program: Orca
programVersion: 5.0.4
elementType: S S P O O O N C C C C C C C C C H H H H H H H H H H H H H H H H H H
charge: 0
multiplicity: 1
keywords: wb97x-d3
keywords: def2-TZVPP
keywords: def2/J RIJCOSX
keywords: DEFGRID2
keywords: scfconv7
keywords: smallprint printgap noloewdin
keywords: NOSOSCF
formula: C9H18NO3PS2
InChI: InChI=1/C9H18NO3PS2/c1-4-8(3)16-14(12,13-5-2)10-6-7-15-9(10)11/h8H,4-7H2,1-3H3
34 atoms
S  1.325963 1.314866 -1.06684
S  -3.267264 -0.081892 1.041107
P  0.388366 -0.5126 -1.143772
O  1.214402 -1.403177 -0.127206
O  0.279342 -0.98697 -2.542196
O  -0.847151 -0.802028 1.759024
N  -1.183208 -0.344395 -0.480734
C  -2.286528 -0.082865 -1.411345
C  1.322567 1.752779 0.738235
C  -3.368263 0.630086 -0.621163
C  2.728995 2.188251 1.129506
C  -1.547193 -0.471083 0.835892
C  0.274813 2.818294 0.993883
C  3.760032 1.074259 1.07343
C  0.968562 -2.824243 0.012126
C  1.602309 -3.286381 1.297077
H  -2.654726 -1.026215 -1.81587
H  -1.954982 0.541942 -2.238299
H  1.07477 0.851942 1.299204
H  -3.195236 1.704059 -0.566748
H  -4.35222 0.452348 -1.049001
H  3.043545 3.034729 0.511819
H  2.664569 2.569724 2.153142
H  0.490849 3.735355 0.443931
H  0.253722 3.062608 2.057945
H  -0.72302 2.482327 0.711654
H  3.468604 0.234641 1.707316
H  3.895907 0.694079 0.060623
H  4.729857 1.429603 1.423218
H  -0.104274 -3.028415 0.011316
H  1.408958 -3.330941 -0.847649
H  1.143864 -2.815048 2.165756
H  1.469126 -4.36463 1.390345
H  2.673354 -3.081504 1.311683
elementType: S P O N C H
totalener: -1772.21213744 hartree
nucrepener: 1713.20558099 hartree
electener: -3485.41771843 hartree
oneelecener: -5846.09678781 hartree
twoeener: 2360.67906938 hartree
cpcmener: -0.02932760 hartree
kineticenergy: 1767.21757291 hartree
xcener: -116.180278524380 hartree
chargesum: 0.0000000
charge: -0.192119 -0.058349 0.739087 -0.316518 -0.614543 -0.431307 -0.113338 -0.083159 0.066833 -0.119919 -0.103218 0.246432 -0.266424 -0.263618 -0.007752 -0.241438 0.121508 0.115471 0.073629 0.117849 0.130959 0.078401 0.077248 0.100810 0.100444 0.083956 0.079262 0.075381 0.097151 0.117620 0.120289 0.086021 0.093951 0.089399
qa: -0.1921 -0.0583 0.7391 -0.3165 -0.6145 -0.4313 -0.1133 -0.0832 0.0668 -0.1199 -0.1032 0.2464 -0.2664 -0.2636 -0.0078 -0.2414 0.1215 0.1155 0.0736 0.1178 0.1310 0.0784 0.0772 0.1008 0.1004 0.0840 0.0793 0.0754 0.0972 0.1176 0.1203 0.0860 0.0940 0.0894
va: 2.2757 2.3716 5.4482 2.0972 2.0050 2.0475 3.0016 3.9456 3.8137 3.9415 3.8755 4.3030 3.9511 3.9386 3.8569 3.9396 1.0060 1.0072 1.0511 1.0051 1.0109 1.0116 1.0070 1.0057 1.0039 1.0121 1.0019 1.0160 1.0059 0.9842 0.9993 1.0121 1.0079 1.0019
dispcorr: -0.018685616 hartree
energy: -1772.230823053321
dipole: 12.30506 -13.29798 -0.99292 3.74632 -3.00744 0.73889 9.20482 -8.69670 0.50812
magnitude: 1.33792 au
magnitude: 3.40071 debye
