program: Orca
programVersion: 5.0.4
elementType: S S P O O O N C C C C C C C C C H H H H H H H H H H H H H H H H H H
charge: 0
multiplicity: 1
keywords: wb97x-d3
keywords: def2-TZVPP
keywords: def2/J RIJCOSX
keywords: DEFGRID2
keywords: scfconv7
keywords: smallprint printgap noloewdin
keywords: NOSOSCF
formula: C9H18NO3PS2
InChI: InChI=1/C9H18NO3PS2/c1-4-8(3)16-14(12,13-5-2)10-6-7-15-9(10)11/h8H,4-7H2,1-3H3
34 atoms
S  1.689867 0.615165 1.000283
S  -3.291671 -0.018407 0.698126
P  0.766315 -0.577604 -0.412309
O  1.077271 -1.991449 0.244092
O  1.176267 -0.358811 -1.821085
O  -1.095866 -0.797211 1.945322
N  -0.92722 -0.373945 -0.300464
C  -1.770145 -0.131334 -1.470631
C  2.302666 2.040819 -0.010926
C  -2.988106 0.627351 -0.971028
C  1.395016 3.252668 0.138198
C  -1.586848 -0.464051 0.896019
C  3.723231 2.326826 0.447385
C  -0.024883 3.050042 -0.35973
C  0.363487 -3.203374 -0.079114
C  0.487638 -3.609525 -1.527861
H  -2.06212 -1.083537 -1.91696
H  -1.23708 0.451964 -2.216411
H  2.31765 1.71139 -1.050517
H  -2.80704 1.699994 -0.91397
H  -3.853906 0.448759 -1.604624
H  1.384619 3.575056 1.183318
H  1.863351 4.064496 -0.427102
H  4.127383 3.162087 -0.127611
H  4.377016 1.469022 0.295182
H  3.762373 2.604257 1.502223
H  -0.037985 2.684678 -1.388587
H  -0.571941 2.340767 0.261871
H  -0.577501 3.990002 -0.33718
H  0.807251 -3.956956 0.569282
H  -0.684754 -3.099634 0.208932
H  0.0620 -4.607007 -1.644715
H  -0.055682 -2.943849 -2.198609
H  1.529228 -3.653192 -1.84625
elementType: S P O N C H
totalener: -1772.21200552 hartree
nucrepener: 1717.96504363 hartree
electener: -3490.17704915 hartree
oneelecener: -5855.90538852 hartree
twoeener: 2365.72833937 hartree
cpcmener: -0.03160377 hartree
kineticenergy: 1767.22588065 hartree
xcener: -116.184472789239 hartree
chargesum: -0.0000000
charge: -0.191221 -0.060633 0.751330 -0.338201 -0.609612 -0.427186 -0.133940 -0.099085 0.061816 -0.116751 -0.091525 0.262795 -0.278926 -0.287541 0.029008 -0.250746 0.129842 0.122808 0.091231 0.120206 0.130140 0.071279 0.075657 0.096462 0.102625 0.097624 0.086140 0.070795 0.103593 0.110490 0.094387 0.099070 0.081591 0.096481
qa: -0.1912 -0.0606 0.7513 -0.3382 -0.6096 -0.4272 -0.1339 -0.0991 0.0618 -0.1168 -0.0915 0.2628 -0.2789 -0.2875 0.0290 -0.2507 0.1298 0.1228 0.0912 0.1202 0.1301 0.0713 0.0757 0.0965 0.1026 0.0976 0.0861 0.0708 0.1036 0.1105 0.0944 0.0991 0.0816 0.0965
va: 2.3021 2.3682 5.4208 2.1242 1.9813 2.0593 3.0131 3.9184 3.8051 3.9455 3.8698 4.3134 3.9336 3.9561 3.8913 3.9264 0.9994 1.0087 1.0429 1.0053 1.0118 1.0127 1.0083 1.0012 1.0124 1.0024 0.9991 1.0069 1.0080 0.9863 0.9924 1.0079 1.0067 1.0063
dispcorr: -0.018614395 hartree
energy: -1772.230619914721
dipole: 6.68334 -7.74482 -1.06148 8.68794 -8.05420 0.63374 -10.40158 8.69028 -1.71129
magnitude: 2.11114 au
magnitude: 5.36609 debye
