program: Orca
programVersion: 5.0.4
elementType: S S P O O O N C C C C C C C C C H H H H H H H H H H H H H H H H H H
charge: 0
multiplicity: 1
keywords: wb97x-d3
keywords: def2-TZVPP
keywords: def2/J RIJCOSX
keywords: DEFGRID2
keywords: scfconv7
keywords: smallprint printgap noloewdin
keywords: NOSOSCF
formula: C9H18NO3PS2
InChI: InChI=1/C9H18NO3PS2/c1-4-8(3)16-14(12,13-5-2)10-6-7-15-9(10)11/h8H,4-7H2,1-3H3
34 atoms
S  0.781958 1.348179 0.897536
S  -3.556722 -1.113007 0.863601
P  0.356698 -0.133049 -0.470751
O  1.141807 -1.398684 0.09138
O  0.606191 0.18186 -1.898735
O  -1.15633 -1.191316 1.952747
N  -1.300076 -0.437925 -0.214384
C  -2.307153 0.056668 -1.155047
C  2.48565 1.842435 0.348739
C  -3.5474 -0.787824 -0.920857
C  2.389207 2.950816 -0.692432
C  -1.797597 -0.929849 0.967957
C  3.246099 2.236948 1.603749
C  3.743639 3.341409 -1.268173
C  1.399074 -2.558908 -0.734462
C  0.151056 -3.338134 -1.069862
H  -1.960648 -0.05056 -2.179218
H  -2.510968 1.111775 -0.961808
H  2.956161 0.958324 -0.087476
H  -4.450529 -0.255225 -1.209988
H  -3.503916 -1.73301 -1.460691
H  1.740011 2.620165 -1.504333
H  1.90753 3.824335 -0.24373
H  4.270868 2.509298 1.3510
H  3.293307 1.414675 2.316793
H  2.789223 3.0950 2.099527
H  4.404065 3.780851 -0.519773
H  4.256248 2.479501 -1.700953
H  3.618547 4.079304 -2.06151
H  1.926758 -2.25082 -1.638299
H  2.082176 -3.163878 -0.14105
H  0.443108 -4.263516 -1.568478
H  -0.409358 -3.6062 -0.173645
H  -0.507669 -2.79789 -1.750269
elementType: S P O N C H
totalener: -1772.21168643 hartree
nucrepener: 1679.32201382 hartree
electener: -3451.53370025 hartree
oneelecener: -5778.95787828 hartree
twoeener: 2327.42417803 hartree
cpcmener: -0.03144291 hartree
kineticenergy: 1767.22519347 hartree
xcener: -116.180886789872 hartree
chargesum: 0.0000000
charge: -0.196325 -0.055857 0.750850 -0.344073 -0.615534 -0.421074 -0.140731 -0.086566 0.083790 -0.114270 -0.109742 0.257221 -0.281434 -0.282941 0.035472 -0.262570 0.118236 0.125911 0.083877 0.125214 0.118647 0.076588 0.067097 0.099732 0.105618 0.099449 0.085311 0.086048 0.095687 0.099869 0.108638 0.107637 0.091802 0.088423
qa: -0.1963 -0.0559 0.7508 -0.3441 -0.6155 -0.4211 -0.1407 -0.0866 0.0838 -0.1143 -0.1097 0.2572 -0.2814 -0.2829 0.0355 -0.2626 0.1182 0.1259 0.0839 0.1252 0.1186 0.0766 0.0671 0.0997 0.1056 0.0994 0.0853 0.0860 0.0957 0.0999 0.1086 0.1076 0.0918 0.0884
va: 2.2993 2.3781 5.4416 2.0852 1.9793 2.0635 3.0764 3.9236 3.8192 3.9484 3.8970 4.3206 3.9338 3.9541 3.8540 3.9214 1.0142 1.0034 1.0305 1.0113 1.0076 1.0285 1.0163 0.9985 1.0110 1.0010 0.9998 0.9995 1.0036 1.0050 0.9906 1.0102 1.0052 1.0083
dispcorr: -0.016654437 hartree
energy: -1772.228340870904
dipole: 18.67728 -18.79351 -0.11623 7.32634 -7.33587 -0.00953 -10.05187 8.46831 -1.58357
magnitude: 1.58786 au
magnitude: 4.03601 debye
