program: Orca
programVersion: 5.0.4
elementType: S S P O O O N C C C C C C C C C H H H H H H H H H H H H H H H H H H
charge: 0
multiplicity: 1
keywords: wb97x-d3
keywords: def2-TZVPP
keywords: def2/J RIJCOSX
keywords: DEFGRID2
keywords: scfconv7
keywords: smallprint printgap noloewdin
keywords: NOSOSCF
formula: C9H18NO3PS2
InChI: InChI=1/C9H18NO3PS2/c1-4-8(3)16-14(12,13-5-2)10-6-7-15-9(10)11/h8H,4-7H2,1-3H3
34 atoms
S  1.815097 0.461657 0.948842
S  -3.190043 -0.222879 0.748834
P  0.849342 -0.673156 -0.485174
O  1.153949 -2.115802 0.106968
O  1.221278 -0.418568 -1.897851
O  -0.965377 -1.09505 1.87501
N  -0.83319 -0.416274 -0.310261
C  -1.699514 -0.072337 -1.436691
C  2.089335 2.040448 0.021642
C  -2.915224 0.614313 -0.837766
C  0.78914 2.806297 -0.188719
C  -1.474129 -0.654472 0.875879
C  3.114738 2.810922 0.83925
C  0.985343 4.102137 -0.964473
C  1.055247 -3.319045 -0.688482
C  -0.355518 -3.645276 -1.111977
H  -1.98947 -0.978119 -1.972962
H  -1.188422 0.592151 -2.128646
H  2.526744 1.769327 -0.940593
H  -2.737425 1.67421 -0.659082
H  -3.78872 0.504598 -1.476406
H  0.08151 2.182186 -0.738006
H  0.33116 3.013935 0.781959
H  3.409517 3.715052 0.306143
H  4.019848 2.227251 1.007143
H  2.714322 3.111322 1.809179
H  1.56525 4.837547 -0.406611
H  1.494331 3.924922 -1.91405
H  0.020327 4.556926 -1.191051
H  1.715899 -3.23268 -1.552826
H  1.451892 -4.100485 -0.042605
H  -0.741385 -2.947403 -1.856132
H  -0.358991 -4.635983 -1.568905
H  -1.038013 -3.669584 -0.261784
elementType: S P O N C H
totalener: -1772.21088299 hartree
nucrepener: 1705.40252847 hartree
electener: -3477.61341146 hartree
oneelecener: -5830.80149510 hartree
twoeener: 2353.18808364 hartree
cpcmener: -0.03276125 hartree
kineticenergy: 1767.22154869 hartree
xcener: -116.182587758096 hartree
chargesum: 0.0000000
charge: -0.185001 -0.061215 0.755802 -0.345072 -0.611212 -0.427384 -0.130940 -0.101681 0.064243 -0.111937 -0.091301 0.258320 -0.290555 -0.288204 0.033859 -0.269180 0.135084 0.120365 0.087882 0.118142 0.127014 0.053378 0.074468 0.102070 0.104606 0.102127 0.091440 0.088541 0.095447 0.100954 0.108490 0.090723 0.108301 0.092426
qa: -0.1850 -0.0612 0.7558 -0.3451 -0.6112 -0.4274 -0.1309 -0.1017 0.0642 -0.1119 -0.0913 0.2583 -0.2906 -0.2882 0.0339 -0.2692 0.1351 0.1204 0.0879 0.1181 0.1270 0.0534 0.0745 0.1021 0.1046 0.1021 0.0914 0.0885 0.0954 0.1010 0.1085 0.0907 0.1083 0.0924
va: 2.3055 2.3678 5.4177 2.1116 1.9847 2.0586 3.0208 3.9253 3.8435 3.9416 3.8848 4.3287 3.9252 3.9660 3.8643 3.9142 0.9985 1.0069 1.0331 1.0081 1.0109 1.0134 1.0180 0.9967 1.0112 1.0025 0.9981 0.9989 1.0034 1.0006 0.9891 1.0052 1.0101 1.0063
dispcorr: -0.017897430 hartree
energy: -1772.228780422692
dipole: 5.20827 -6.12149 -0.91322 12.77080 -11.85335 0.91745 -10.58920 8.78135 -1.80785
magnitude: 2.22351 au
magnitude: 5.65172 debye
