program: Orca
programVersion: 5.0.4
elementType: S S P O O O N C C C C C C C C C H H H H H H H H H H H H H H H H H H
charge: 0
multiplicity: 1
keywords: wb97x-d3
keywords: def2-TZVPP
keywords: def2/J RIJCOSX
keywords: DEFGRID2
keywords: scfconv7
keywords: smallprint printgap noloewdin
keywords: NOSOSCF
formula: C9H18NO3PS2
InChI: InChI=1/C9H18NO3PS2/c1-4-8(3)16-14(12,13-5-2)10-6-7-15-9(10)11/h8H,4-7H2,1-3H3
34 atoms
S  1.235326 0.59555 1.105342
S  -3.715948 -0.197729 0.532321
P  0.387919 -0.351098 -0.529455
O  0.586614 -1.891455 -0.184537
O  0.848458 0.122098 -1.855998
O  -1.49403 -0.973186 1.735839
N  -1.31001 -0.24727 -0.431682
C  -2.088295 0.433879 -1.465398
C  1.617449 2.302718 0.507003
C  -3.528745 -0.006236 -1.263484
C  2.838899 2.364438 -0.400112
C  -1.984986 -0.545245 0.723618
C  0.399585 2.998227 -0.074413
C  4.109613 1.796384 0.207023
C  1.908017 -2.472785 -0.117662
C  1.767473 -3.965866 -0.250679
H  -1.741364 0.149962 -2.455508
H  -1.99508 1.516012 -1.357025
H  1.866961 2.783691 1.457812
H  -4.227711 0.738831 -1.636431
H  -3.733425 -0.959832 -1.748366
H  2.620964 1.874572 -1.349656
H  2.995156 3.422784 -0.631916
H  0.626766 4.055646 -0.222176
H  -0.460035 2.933866 0.591883
H  0.120876 2.590545 -1.045601
H  4.957433 1.95652 -0.460132
H  4.346649 2.274319 1.159884
H  4.032662 0.722853 0.383786
H  2.534311 -2.069927 -0.916853
H  2.363659 -2.206324 0.837593
H  2.753761 -4.424326 -0.174506
H  1.144031 -4.381564 0.541303
H  1.341438 -4.243793 -1.214904
elementType: S P O N C H
totalener: -1772.21154381 hartree
nucrepener: 1695.10476808 hartree
electener: -3467.31631189 hartree
oneelecener: -5810.56912976 hartree
twoeener: 2343.25281786 hartree
cpcmener: -0.02966036 hartree
kineticenergy: 1767.24101206 hartree
xcener: -116.185443465192 hartree
chargesum: -0.0000000
charge: -0.208957 -0.063332 0.767161 -0.352631 -0.606189 -0.427623 -0.113555 -0.084400 0.110665 -0.119956 -0.135247 0.261271 -0.307163 -0.266284 0.019730 -0.248023 0.116635 0.124512 0.100301 0.122962 0.121220 0.081321 0.080184 0.109128 0.105663 0.083832 0.093792 0.084472 0.073241 0.108381 0.101755 0.088144 0.090280 0.088711
qa: -0.2090 -0.0633 0.7672 -0.3526 -0.6062 -0.4276 -0.1136 -0.0844 0.1107 -0.1200 -0.1352 0.2613 -0.3072 -0.2663 0.0197 -0.2480 0.1166 0.1245 0.1003 0.1230 0.1212 0.0813 0.0802 0.1091 0.1057 0.0838 0.0938 0.0845 0.0732 0.1084 0.1018 0.0881 0.0903 0.0887
va: 2.2827 2.3637 5.4325 2.1473 1.9884 2.0583 3.0899 3.9265 3.7639 3.9618 3.8826 4.3319 3.9349 3.9421 3.8659 3.9804 1.0111 0.9943 1.0087 1.0104 1.0083 1.0256 1.0064 1.0047 1.0079 1.0162 1.0047 1.0014 1.0123 0.9902 0.9924 1.0060 1.0025 1.0049
dispcorr: -0.016803656 hartree
energy: -1772.228347464346
dipole: 18.42688 -18.34327 0.08361 6.79085 -5.79539 0.99546 -6.81852 5.59231 -1.22621
magnitude: 1.58163 au
magnitude: 4.02017 debye
