program: Orca
programVersion: 5.0.4
elementType: S S P O O O N C C C C C C C C C H H H H H H H H H H H H H H H H H H
charge: 0
multiplicity: 1
keywords: wb97x-d3
keywords: def2-TZVPP
keywords: def2/J RIJCOSX
keywords: DEFGRID2
keywords: scfconv7
keywords: smallprint printgap noloewdin
keywords: NOSOSCF
formula: C9H18NO3PS2
InChI: InChI=1/C9H18NO3PS2/c1-4-8(3)16-14(12,13-5-2)10-6-7-15-9(10)11/h8H,4-7H2,1-3H3
34 atoms
S  0.607189 1.615137 0.660844
S  -3.785861 -0.596677 0.329673
P  0.330348 -0.031007 -0.557476
O  0.938722 -1.227844 0.291279
O  0.794071 0.078172 -1.961927
O  -1.554161 -0.690547 1.729466
N  -1.35963 -0.266454 -0.521954
C  -2.195592 0.161673 -1.645562
C  2.312913 2.208793 0.235769
C  -3.530229 -0.540414 -1.465214
C  3.390604 1.139932 0.355321
C  -2.043199 -0.535812 0.640412
C  2.337763 2.936291 -1.095983
C  3.528404 0.516382 1.733211
C  1.036748 -2.574944 -0.220999
C  2.301799 -3.18941 0.318531
H  -1.74033 -0.123515 -2.589915
H  -2.320374 1.246308 -1.62794
H  2.461083 2.939886 1.036521
H  -4.336612 0.012117 -1.941683
H  -3.512762 -1.555204 -1.860299
H  3.241485 0.370282 -0.405929
H  4.333308 1.629648 0.092441
H  3.303484 3.431553 -1.21651
H  1.564506 3.701739 -1.148758
H  2.205345 2.256191 -1.935083
H  4.345691 -0.205748 1.744586
H  3.7494 1.274188 2.487078
H  2.625447 -0.006601 2.045473
H  0.155009 -3.125011 0.111184
H  1.044015 -2.570386 -1.312521
H  3.18425 -2.648861 -0.024431
H  2.304955 -3.207132 1.408561
H  2.380678 -4.218822 -0.031997
elementType: S P O N C H
totalener: -1772.21149015 hartree
nucrepener: 1697.82515077 hartree
electener: -3470.03664092 hartree
oneelecener: -5816.13082078 hartree
twoeener: 2346.09417986 hartree
cpcmener: -0.03023450 hartree
kineticenergy: 1767.23062331 hartree
xcener: -116.181977953143 hartree
chargesum: -0.0000000
charge: -0.204528 -0.055429 0.775540 -0.331089 -0.615984 -0.425362 -0.160941 -0.083207 0.098728 -0.115643 -0.121679 0.261805 -0.283405 -0.283244 0.034911 -0.257032 0.116440 0.121700 0.094110 0.122800 0.118153 0.063322 0.089958 0.099155 0.096481 0.095205 0.097930 0.093994 0.073484 0.103211 0.100261 0.087850 0.092905 0.099601
qa: -0.2045 -0.0554 0.7755 -0.3311 -0.6160 -0.4254 -0.1609 -0.0832 0.0987 -0.1156 -0.1217 0.2618 -0.2834 -0.2832 0.0349 -0.2570 0.1164 0.1217 0.0941 0.1228 0.1182 0.0633 0.0900 0.0992 0.0965 0.0952 0.0979 0.0940 0.0735 0.1032 0.1003 0.0878 0.0929 0.0996
va: 2.2828 2.3809 5.4263 2.0970 1.9863 2.0595 3.1143 3.9359 3.8000 3.9539 3.8590 4.3213 3.9454 3.9439 3.8604 3.9420 1.0128 1.0027 1.0072 1.0110 1.0088 1.0273 1.0059 1.0031 1.0109 1.0189 1.0021 1.0041 1.0182 0.9916 1.0014 1.0035 1.0017 1.0082
dispcorr: -0.017400995 hartree
energy: -1772.228891142795
dipole: 23.06221 -22.97888 0.08333 -0.73432 0.57327 -0.16104 -3.77072 2.28537 -1.48535
magnitude: 1.49638 au
magnitude: 3.80350 debye
