program: Orca
programVersion: 5.0.4
elementType: S S P O O O N C C C C C C C C C H H H H H H H H H H H H H H H H H H
charge: 0
multiplicity: 1
keywords: wb97x-d3
keywords: def2-TZVPP
keywords: def2/J RIJCOSX
keywords: DEFGRID2
keywords: scfconv7
keywords: smallprint printgap noloewdin
keywords: NOSOSCF
formula: C9H18NO3PS2
InChI: InChI=1/C9H18NO3PS2/c1-4-8(3)16-14(12,13-5-2)10-6-7-15-9(10)11/h8H,4-7H2,1-3H3
34 atoms
S  1.540991 0.389608 0.861962
S  -3.487733 0.039825 0.720781
P  0.477249 -0.555403 -0.641785
O  0.558996 -2.099328 -0.261747
O  0.883462 -0.174238 -2.014814
O  -1.263781 -0.925101 1.7762
N  -1.18101 -0.264224 -0.415221
C  -2.063895 0.116818 -1.517042
C  2.252837 1.86057 -0.013459
C  -3.235524 0.850669 -0.884345
C  1.44363 3.116338 0.2745
C  -1.791286 -0.470364 0.79283
C  3.698927 1.988062 0.433919
C  -0.002897 3.063668 -0.185976
C  1.818704 -2.806275 -0.275571
C  1.527169 -4.28285 -0.224174
H  -2.402555 -0.776697 -2.045019
H  -1.545819 0.762191 -2.222242
H  2.22479 1.637083 -1.080203
H  -3.018376 1.906959 -0.724801
H  -4.132775 0.76302 -1.493136
H  1.48967 3.34484 1.34312
H  1.955638 3.938494 -0.235302
H  4.153649 2.848862 -0.06031
H  4.281289 1.105589 0.171187
H  3.781715 2.145349 1.510953
H  -0.58682 2.352422 0.399253
H  -0.477323 4.03902 -0.07268
H  -0.078572 2.783108 -1.238738
H  2.376768 -2.553677 -1.180327
H  2.412175 -2.495677 0.586794
H  2.470039 -4.830963 -0.225912
H  0.985031 -4.553806 0.68252
H  0.949139 -4.608663 -1.089541
elementType: S P O N C H
totalener: -1772.21358846 hartree
nucrepener: 1700.18461220 hartree
electener: -3472.39820065 hartree
oneelecener: -5820.62855506 hartree
twoeener: 2348.23035440 hartree
cpcmener: -0.02934948 hartree
kineticenergy: 1767.23382551 hartree
xcener: -116.184271800393 hartree
chargesum: -0.0000000
charge: -0.207833 -0.061292 0.771637 -0.347673 -0.612487 -0.431152 -0.121586 -0.102344 0.077218 -0.116732 -0.100970 0.264561 -0.277734 -0.281965 0.023392 -0.246589 0.133836 0.120822 0.092706 0.119024 0.129378 0.071179 0.076604 0.095803 0.101899 0.097494 0.072461 0.103166 0.083998 0.107263 0.099719 0.087870 0.089856 0.088468
qa: -0.2078 -0.0613 0.7716 -0.3477 -0.6125 -0.4312 -0.1216 -0.1023 0.0772 -0.1167 -0.1010 0.2646 -0.2777 -0.2820 0.0234 -0.2466 0.1338 0.1208 0.0927 0.1190 0.1294 0.0712 0.0766 0.0958 0.1019 0.0975 0.0725 0.1032 0.0840 0.1073 0.0997 0.0879 0.0899 0.0885
va: 2.2846 2.3650 5.4250 2.1468 1.9919 2.0559 3.0665 3.9285 3.7942 3.9372 3.8716 4.3254 3.9305 3.9458 3.8577 3.9727 1.0006 1.0067 1.0452 1.0058 1.0118 1.0129 1.0085 1.0018 1.0121 1.0023 1.0078 1.0081 1.0016 0.9919 0.9965 1.0062 1.0030 1.0050
dispcorr: -0.017162777 hartree
energy: -1772.230751231594
dipole: 13.69004 -13.50830 0.18174 8.27687 -7.21561 1.06126 -5.50641 4.23936 -1.26705
magnitude: 1.66275 au
magnitude: 4.22637 debye
