program: Orca
programVersion: 5.0.4
elementType: S S P O O O N C C C C C C C C C H H H H H H H H H H H H H H H H H H
charge: 0
multiplicity: 1
keywords: wb97x-d3
keywords: def2-TZVPP
keywords: def2/J RIJCOSX
keywords: DEFGRID2
keywords: scfconv7
keywords: smallprint printgap noloewdin
keywords: NOSOSCF
formula: C9H18NO3PS2
InChI: InChI=1/C9H18NO3PS2/c1-4-8(3)16-14(12,13-5-2)10-6-7-15-9(10)11/h8H,4-7H2,1-3H3
34 atoms
S  1.53077 0.112328 0.904537
S  -3.518715 0.145609 0.80344
P  0.386659 -0.717854 -0.608603
O  0.345767 -2.270304 -0.268148
O  0.811136 -0.327348 -1.973316
O  -1.382313 -1.051033 1.799049
N  -1.235679 -0.264253 -0.346705
C  -2.091176 0.219596 -1.429206
C  2.081862 1.686407 0.102335
C  -3.199042 1.013937 -0.759372
C  0.936909 2.685408 -0.010576
C  -1.864767 -0.493137 0.846724
C  3.240716 2.188352 0.948801
C  1.330236 3.951082 -0.760931
C  1.30044 -3.212264 -0.809132
C  2.609103 -3.2145 -0.059256
H  -2.498827 -0.625457 -1.987348
H  -1.528914 0.849979 -2.113361
H  2.449004 1.421397 -0.890183
H  -2.893664 2.037388 -0.545603
H  -4.09991 1.032363 -1.368405
H  0.09616 2.22536 -0.534449
H  0.576349 2.93508 0.991054
H  2.922423 2.441396 1.96161
H  3.667049 3.086201 0.500831
H  4.040428 1.450553 1.014125
H  0.4657 4.605442 -0.877993
H  2.099559 4.522956 -0.24172
H  1.703222 3.719682 -1.760611
H  0.806728 -4.179235 -0.726326
H  1.454141 -3.008872 -1.870357
H  3.225044 -4.032023 -0.43654
H  3.167536 -2.289139 -0.197187
H  2.459582 -3.374856 1.008694
elementType: S P O N C H
totalener: -1772.21104025 hartree
nucrepener: 1693.68092916 hartree
electener: -3465.89196941 hartree
oneelecener: -5807.62728328 hartree
twoeener: 2341.73531387 hartree
cpcmener: -0.03060301 hartree
kineticenergy: 1767.23538144 hartree
xcener: -116.185140987157 hartree
chargesum: 0.0000000
charge: -0.190459 -0.062094 0.762423 -0.353643 -0.614544 -0.431450 -0.126311 -0.090595 0.084605 -0.116725 -0.091713 0.260359 -0.290341 -0.284135 0.032058 -0.253190 0.133375 0.118049 0.087521 0.117792 0.127044 0.053055 0.072442 0.100611 0.100984 0.104800 0.094759 0.088562 0.087085 0.107610 0.096948 0.100105 0.083454 0.091560
qa: -0.1905 -0.0621 0.7624 -0.3536 -0.6145 -0.4315 -0.1263 -0.0906 0.0846 -0.1167 -0.0917 0.2604 -0.2903 -0.2841 0.0321 -0.2532 0.1334 0.1180 0.0875 0.1178 0.1270 0.0531 0.0724 0.1006 0.1010 0.1048 0.0948 0.0886 0.0871 0.1076 0.0969 0.1001 0.0835 0.0916
va: 2.2982 2.3673 5.4135 2.1388 1.9845 2.0547 3.0561 3.9200 3.8092 3.9468 3.9031 4.3359 3.9296 3.9649 3.8708 3.9004 1.0015 1.0075 1.0386 1.0069 1.0107 1.0129 1.0177 1.0026 0.9979 1.0095 1.0033 1.0001 0.9996 0.9895 1.0049 1.0098 1.0139 1.0035
dispcorr: -0.016710929 hartree
energy: -1772.227751178546
dipole: 16.81997 -16.74265 0.07732 12.89592 -11.77932 1.11660 -6.67380 5.18103 -1.49277
magnitude: 1.86578 au
magnitude: 4.74244 debye
