program: Orca
programVersion: 5.0.4
elementType: S S P O O O N C C C C C C C C C H H H H H H H H H H H H H H H H H H
charge: 0
multiplicity: 1
keywords: wb97x-d3
keywords: def2-TZVPP
keywords: def2/J RIJCOSX
keywords: DEFGRID2
keywords: scfconv7
keywords: smallprint printgap noloewdin
keywords: NOSOSCF
formula: C9H18NO3PS2
InChI: InChI=1/C9H18NO3PS2/c1-4-8(3)16-14(12,13-5-2)10-6-7-15-9(10)11/h8H,4-7H2,1-3H3
34 atoms
S  0.580776 1.727504 0.635247
S  -3.667325 -0.88169 0.263467
P  0.443623 -0.042664 -0.421662
O  1.045159 -1.138127 0.564992
O  0.987307 -0.055516 -1.800861
O  -1.552035 -0.585676 1.81175
N  -1.238456 -0.335647 -0.451064
C  -2.029196 -0.086326 -1.656314
C  2.240664 2.41098 0.172631
C  -3.284691 -0.928027 -1.510564
C  3.392107 1.44183 0.403747
C  -1.971262 -0.581033 0.683227
C  2.226966 3.011391 -1.220714
C  3.551273 0.97417 1.839683
C  1.454111 -2.442753 0.094391
C  0.289816 -3.334057 -0.263665
H  -1.474943 -0.376285 -2.544813
H  -2.276827 0.974813 -1.727779
H  2.321356 3.222496 0.90225
H  -4.111328 -0.512868 -2.082552
H  -3.121321 -1.959863 -1.818663
H  3.30961 0.590068 -0.275914
H  4.300639 1.970189 0.09909
H  2.138742 2.250728 -1.993916
H  3.161516 3.5511 -1.387649
H  1.409588 3.721329 -1.342482
H  3.705559 1.819848 2.512458
H  2.680368 0.424075 2.195254
H  4.41636 0.317194 1.934691
H  2.136169 -2.329851 -0.750012
H  2.02031 -2.862956 0.92377
H  -0.241638 -2.987141 -1.150381
H  0.672121 -4.331874 -0.483652
H  -0.41847 -3.422735 0.560423
elementType: S P O N C H
totalener: -1772.21046852 hartree
nucrepener: 1709.36929975 hartree
electener: -3481.57976827 hartree
oneelecener: -5839.17985446 hartree
twoeener: 2357.60008618 hartree
cpcmener: -0.03035267 hartree
kineticenergy: 1767.22842962 hartree
xcener: -116.183041950622 hartree
chargesum: 0.0000000
charge: -0.207101 -0.057745 0.762054 -0.341378 -0.613579 -0.423150 -0.146858 -0.090086 0.095616 -0.115246 -0.122229 0.259902 -0.284975 -0.271549 0.038381 -0.263015 0.118759 0.124167 0.094397 0.125746 0.118993 0.066427 0.089464 0.096331 0.098303 0.097323 0.087251 0.073686 0.095969 0.099445 0.107320 0.087480 0.107786 0.092112
qa: -0.2071 -0.0577 0.7621 -0.3414 -0.6136 -0.4232 -0.1469 -0.0901 0.0956 -0.1152 -0.1222 0.2599 -0.2850 -0.2715 0.0384 -0.2630 0.1188 0.1242 0.0944 0.1257 0.1190 0.0664 0.0895 0.0963 0.0983 0.0973 0.0873 0.0737 0.0960 0.0994 0.1073 0.0875 0.1078 0.0921
va: 2.2884 2.3776 5.4162 2.0825 1.9795 2.0630 3.0928 3.9287 3.7958 3.9485 3.8696 4.3161 3.9478 3.9488 3.8496 3.9338 1.0140 1.0035 1.0076 1.0114 1.0074 1.0256 1.0046 1.0185 1.0033 1.0102 1.0026 1.0175 1.0034 1.0035 0.9894 1.0080 1.0099 1.0054
dispcorr: -0.018031317 hartree
energy: -1772.228499841682
dipole: 19.24775 -19.01242 0.23533 0.13692 -0.38423 -0.24731 -5.37428 3.74266 -1.63162
magnitude: 1.66695 au
magnitude: 4.23705 debye
