program: Orca
programVersion: 5.0.4
elementType: S S P O O O N C C C C C C C C C H H H H H H H H H H H H H H H H H H
charge: 0
multiplicity: 1
keywords: wb97x-d3
keywords: def2-TZVPP
keywords: def2/J RIJCOSX
keywords: DEFGRID2
keywords: scfconv7
keywords: smallprint printgap noloewdin
keywords: NOSOSCF
formula: C9H18NO3PS2
InChI: InChI=1/C9H18NO3PS2/c1-4-8(3)16-14(12,13-5-2)10-6-7-15-9(10)11/h8H,4-7H2,1-3H3
34 atoms
S  0.797086 1.05289 0.624704
S  -3.778186 -0.838302 0.38187
P  0.237679 -0.282854 -0.87429
O  0.775077 -1.728429 -0.502213
O  0.548962 0.173012 -2.24195
O  -1.387999 -1.129151 1.488377
N  -1.452312 -0.453205 -0.696476
C  -2.37843 0.128865 -1.655265
C  2.11026 1.989071 -0.279971
C  -3.708225 -0.571035 -1.41133
C  2.305608 3.313435 0.45633
C  -2.002862 -0.842622 0.49838
C  3.38159 1.170866 -0.416128
C  2.837308 3.204509 1.878351
C  1.536962 -2.147201 0.635106
C  1.135866 -3.556262 0.994672
H  -2.02325 -0.032087 -2.669928
H  -2.472874 1.205319 -1.489608
H  1.708583 2.199596 -1.270934
H  -4.547908 0.042139 -1.731185
H  -3.756561 -1.53098 -1.92473
H  2.999919 3.907963 -0.145261
H  1.35999 3.860143 0.456093
H  3.742808 0.812374 0.547022
H  4.169049 1.776793 -0.869991
H  3.224368 0.309514 -1.064383
H  3.817256 2.728722 1.911697
H  2.943056 4.194804 2.320389
H  2.168421 2.632253 2.522309
H  2.595295 -2.097388 0.368527
H  1.371288 -1.473668 1.475482
H  0.092742 -3.596058 1.303705
H  1.283665 -4.241931 0.161038
H  1.747899 -3.903953 1.827443
totalener: -1772.18695945 hartree
nucrepener: 1684.40172733 hartree
electener: -3456.58868679 hartree
oneelecener: -5788.44129793 hartree
twoeener: 2331.85261114 hartree
kineticenergy: 1767.27646013 hartree
xcener: -116.189261973651 hartree
chargesum: 0.0000000
charge: -0.214700 -0.031191 0.732009 -0.314047 -0.527843 -0.370583 -0.152488 -0.093522 0.081822 -0.136022 -0.122974 0.251762 -0.316246 -0.254571 0.008823 -0.226168 0.114672 0.102716 0.101018 0.103117 0.106707 0.070094 0.085383 0.087018 0.097354 0.104959 0.076796 0.090514 0.084218 0.095628 0.112572 0.092980 0.084836 0.075356
qa: -0.2147 -0.0312 0.7320 -0.3140 -0.5278 -0.3706 -0.1525 -0.0935 0.0818 -0.1360 -0.1230 0.2518 -0.3162 -0.2546 0.0088 -0.2262 0.1147 0.1027 0.1010 0.1031 0.1067 0.0701 0.0854 0.0870 0.0974 0.1050 0.0768 0.0905 0.0842 0.0956 0.1126 0.0930 0.0848 0.0754
va: 2.2816 2.3743 5.4679 2.1287 2.1001 2.1135 3.1097 3.9579 3.8463 3.9730 3.8849 4.3131 3.9440 3.9386 3.8536 3.9511 1.0112 1.0048 1.0339 1.0122 1.0054 1.0069 1.0164 1.0003 1.0064 1.0184 1.0007 1.0065 1.0076 0.9886 1.0010 1.0140 1.0040 1.0093
dispcorr: -0.016361841 hartree
energy: -1772.203321294739
dipole: 20.51081 -20.43573 0.07508 7.25641 -6.84926 0.40715 3.16887 -3.43974 -0.27087
magnitude: 0.49475 au
magnitude: 1.25756 debye
