program: Orca
programVersion: 5.0.4
elementType: S S P O O O N C C C C C C C C C H H H H H H H H H H H H H H H H H H
charge: 0
multiplicity: 1
keywords: wb97x-d3
keywords: def2-TZVPP
keywords: def2/J RIJCOSX
keywords: DEFGRID2
keywords: scfconv7
keywords: smallprint printgap noloewdin
keywords: NOSOSCF
formula: C9H18NO3PS2
InChI: InChI=1/C9H18NO3PS2/c1-4-8(3)16-14(12,13-5-2)10-6-7-15-9(10)11/h8H,4-7H2,1-3H3
34 atoms
S  1.007973 0.470949 0.872464
S  -3.871953 -0.575465 0.363394
P  0.222294 -0.529308 -0.767206
O  0.499751 -2.068007 -0.460369
O  0.64468 0.000495 -2.080283
O  -1.589665 -1.221361 1.545883
N  -1.470969 -0.475865 -0.620143
C  -2.330809 -0.221432 -1.766717
C  1.591035 2.028832 0.065241
C  -3.635575 0.317033 -1.196693
C  1.474524 3.130415 1.116876
C  -2.113968 -0.821976 0.549326
C  2.994319 1.8444 -0.481286
C  1.800226 4.51065 0.560256
C  1.834603 -2.585032 -0.402125
C  1.763548 -4.024842 0.044025
H  -2.507435 -1.14664 -2.320362
H  -1.863172 0.493445 -2.439664
H  0.905188 2.246439 -0.755181
H  -3.578105 1.387566 -1.000279
H  -4.470759 0.128111 -1.867641
H  0.45798 3.133096 1.515198
H  2.134843 2.906357 1.959868
H  3.339658 2.75416 -0.974571
H  3.018853 1.046313 -1.219865
H  3.697943 1.603051 0.316425
H  1.178918 4.745425 -0.305633
H  1.617785 5.27822 1.311828
H  2.84228 4.598549 0.25459
H  2.299513 -2.502546 -1.387833
H  2.428232 -1.992185 0.299524
H  1.192834 -4.631268 -0.658489
H  2.770019 -4.438493 0.104922
H  1.302107 -4.10903 1.026946
totalener: -1772.18823033 hartree
nucrepener: 1666.87809293 hartree
electener: -3439.06632326 hartree
oneelecener: -5753.44570679 hartree
twoeener: 2314.37938353 hartree
kineticenergy: 1767.28091144 hartree
xcener: -116.184142290512 hartree
chargesum: -0.0000000
charge: -0.173059 -0.039232 0.703760 -0.306108 -0.530036 -0.332670 -0.143193 -0.099240 0.070091 -0.130042 -0.100933 0.238534 -0.284523 -0.266258 0.019325 -0.234037 0.105953 0.112328 0.069204 0.101851 0.102102 0.083212 0.072279 0.086518 0.103842 0.084959 0.078736 0.091540 0.078707 0.100865 0.082008 0.084362 0.074661 0.094495
qa: -0.1731 -0.0392 0.7038 -0.3061 -0.5300 -0.3327 -0.1432 -0.0992 0.0701 -0.1300 -0.1009 0.2385 -0.2845 -0.2663 0.0193 -0.2340 0.1060 0.1123 0.0692 0.1019 0.1021 0.0832 0.0723 0.0865 0.1038 0.0850 0.0787 0.0915 0.0787 0.1009 0.0820 0.0844 0.0747 0.0945
va: 2.3041 2.3607 5.4856 2.1596 2.0786 2.1513 3.0983 3.9626 3.8497 3.9648 3.8566 4.3387 3.9447 3.9506 3.8646 3.9656 1.0003 1.0112 1.0416 1.0055 1.0122 1.0184 1.0126 1.0057 1.0243 1.0062 1.0014 1.0061 1.0033 0.9917 1.0052 1.0059 1.0080 1.0055
dispcorr: -0.015219073 hartree
energy: -1772.203449399824
dipole: 18.71335 -18.55811 0.15524 12.18774 -11.58579 0.60195 -3.26255 2.50663 -0.75592
magnitude: 0.97870 au
magnitude: 2.48766 debye
