program: Orca
programVersion: 5.0.4
elementType: S S P O O O N C C C C C C C C C H H H H H H H H H H H H H H H H H H
charge: 0
multiplicity: 1
keywords: wb97x-d3
keywords: def2-TZVPP
keywords: def2/J RIJCOSX
keywords: DEFGRID2
keywords: scfconv7
keywords: smallprint printgap noloewdin
keywords: NOSOSCF
formula: C9H18NO3PS2
InChI: InChI=1/C9H18NO3PS2/c1-4-8(3)16-14(12,13-5-2)10-6-7-15-9(10)11/h8H,4-7H2,1-3H3
34 atoms
S  1.616563 0.79856 1.057257
S  -3.244215 -0.075676 0.155076
P  0.960642 -0.608334 -0.296719
O  1.191173 -1.922513 0.570089
O  1.535649 -0.534299 -1.657042
O  -1.227966 -0.586514 1.797504
N  -0.742444 -0.453503 -0.439161
C  -1.411543 -0.41588 -1.731399
C  2.378734 2.027585 -0.093373
C  -2.701751 0.362869 -1.518326
C  2.244466 3.402706 0.554659
C  -1.567503 -0.415792 0.663577
C  3.821098 1.650609 -0.375876
C  0.815631 3.913267 0.651034
C  0.583764 -3.177694 0.249568
C  1.260078 -3.865338 -0.916452
H  -1.631941 -1.430577 -2.073428
H  -0.775728 0.058152 -2.4749
H  1.808532 2.013055 -1.023852
H  -2.538327 1.43884 -1.577823
H  -3.461541 0.083648 -2.245128
H  2.712883 3.391458 1.543372
H  2.838728 4.096725 -0.047428
H  4.275977 2.387638 -1.041265
H  3.88375 0.679087 -0.860996
H  4.407294 1.616958 0.542837
H  0.78934 4.915097 1.078847
H  0.35155 3.964887 -0.335441
H  0.197422 3.269285 1.275772
H  0.67099 -3.773808 1.156617
H  -0.484582 -3.043265 0.056936
H  1.151504 -3.301515 -1.841903
H  2.324078 -4.002106 -0.728318
H  0.815185 -4.849706 -1.065234
totalener: -1772.18684131 hartree
nucrepener: 1695.69549510 hartree
electener: -3467.88233641 hartree
oneelecener: -5810.95255789 hartree
twoeener: 2343.07022148 hartree
kineticenergy: 1767.28253907 hartree
xcener: -116.185514736504 hartree
chargesum: -0.0000000
charge: -0.144656 -0.036110 0.716073 -0.297871 -0.533613 -0.325500 -0.169100 -0.092573 0.046271 -0.125661 -0.101691 0.222463 -0.258927 -0.244520 0.008501 -0.226829 0.096056 0.113456 0.060880 0.102729 0.102191 0.074149 0.066091 0.078592 0.105630 0.085663 0.088865 0.064703 0.086607 0.102259 0.077228 0.085826 0.090546 0.082273
qa: -0.1447 -0.0361 0.7161 -0.2979 -0.5336 -0.3255 -0.1691 -0.0926 0.0463 -0.1257 -0.1017 0.2225 -0.2589 -0.2445 0.0085 -0.2268 0.0961 0.1135 0.0609 0.1027 0.1022 0.0741 0.0661 0.0786 0.1056 0.0857 0.0889 0.0647 0.0866 0.1023 0.0772 0.0858 0.0905 0.0823
va: 2.3260 2.3650 5.4496 2.1462 2.0647 2.1613 3.0267 3.9558 3.8569 3.9643 3.8573 4.3389 3.9478 3.9483 3.9335 3.9176 1.0001 1.0153 1.0397 1.0056 1.0123 1.0124 1.0072 1.0067 1.0239 1.0085 1.0073 1.0037 1.0141 0.9910 0.9961 1.0180 1.0082 1.0095
dispcorr: -0.016662534 hartree
energy: -1772.203503843902
dipole: 11.30871 -11.68484 -0.37614 7.59828 -7.45039 0.14789 -8.53978 7.30659 -1.23320
magnitude: 1.29774 au
magnitude: 3.29859 debye
