program: Orca
programVersion: 5.0.4
elementType: S S P O O O N C C C C C C C C C H H H H H H H H H H H H H H H H H H
charge: 0
multiplicity: 1
keywords: wb97x-d3
keywords: def2-TZVPP
keywords: def2/J RIJCOSX
keywords: DEFGRID2
keywords: scfconv7
keywords: smallprint printgap noloewdin
keywords: NOSOSCF
formula: C9H18NO3PS2
InChI: InChI=1/C9H18NO3PS2/c1-4-8(3)16-14(12,13-5-2)10-6-7-15-9(10)11/h8H,4-7H2,1-3H3
34 atoms
S  1.195658 0.52669 0.719886
S  -3.692439 -0.63338 0.620543
P  0.281889 -0.464608 -0.859496
O  0.588437 -2.007041 -0.60623
O  0.580272 0.092111 -2.194685
O  -1.285993 -1.13849 1.615668
N  -1.391632 -0.433366 -0.56201
C  -2.352753 -0.235207 -1.636241
C  1.944189 1.974761 -0.147486
C  -3.631716 0.244763 -0.965176
C  2.079431 3.067529 0.913166
C  -1.915195 -0.787193 0.661119
C  3.260757 1.589701 -0.795969
C  2.586076 4.386434 0.34392
C  1.926622 -2.501809 -0.467762
C  2.123889 -3.069985 0.917236
H  -2.526555 -1.174159 -2.167515
H  -1.977735 0.49527 -2.349528
H  1.23626 2.299956 -0.911404
H  -3.61225 1.319627 -0.785634
H  -4.509057 0.00469 -1.561744
H  1.106053 3.228186 1.381813
H  2.75073 2.727146 1.707472
H  3.706588 2.447674 -1.301671
H  3.114648 0.815659 -1.546493
H  3.972152 1.228437 -0.051796
H  3.612243 4.315454 -0.015797
H  1.96456 4.726366 -0.486359
H  2.565143 5.163125 1.108392
H  2.058287 -3.266048 -1.234882
H  2.659666 -1.713671 -0.665355
H  3.121442 -3.503333 0.998315
H  2.0264 -2.294333 1.676135
H  1.395302 -3.85104 1.131728
totalener: -1772.18770288 hartree
nucrepener: 1675.88114787 hartree
electener: -3448.06885075 hartree
oneelecener: -5771.46667362 hartree
twoeener: 2323.39782287 hartree
kineticenergy: 1767.27977740 hartree
xcener: -116.185381248754 hartree
chargesum: -0.0000000
charge: -0.184810 -0.038258 0.712208 -0.310072 -0.528661 -0.340355 -0.151753 -0.098406 0.087622 -0.132846 -0.104971 0.244594 -0.301685 -0.269453 0.010673 -0.212924 0.106152 0.112570 0.073460 0.103508 0.102390 0.085071 0.073019 0.091521 0.102957 0.087728 0.079055 0.080578 0.091493 0.097067 0.076999 0.078271 0.087397 0.089863
qa: -0.1848 -0.0383 0.7122 -0.3101 -0.5287 -0.3404 -0.1518 -0.0984 0.0876 -0.1328 -0.1050 0.2446 -0.3017 -0.2695 0.0107 -0.2129 0.1062 0.1126 0.0735 0.1035 0.1024 0.0851 0.0730 0.0915 0.1030 0.0877 0.0791 0.0806 0.0915 0.0971 0.0770 0.0783 0.0874 0.0899
va: 2.3062 2.3607 5.4817 2.1379 2.0836 2.1437 3.1051 3.9625 3.8343 3.9660 3.8552 4.3304 3.9442 3.9508 3.9334 3.9144 0.9997 1.0113 1.0412 1.0053 1.0121 1.0178 1.0126 1.0074 1.0227 1.0047 1.0026 1.0014 1.0061 0.9998 0.9982 1.0100 1.0160 1.0074
dispcorr: -0.015815069 hartree
energy: -1772.203517950031
dipole: 20.93368 -20.77686 0.15682 12.73992 -12.16766 0.57227 -2.37438 1.71961 -0.65477
magnitude: 0.88363 au
magnitude: 2.24601 debye
