program: Orca
programVersion: 5.0.4
elementType: S S P O O O N C C C C C C C C C H H H H H H H H H H H H H H H H H H
charge: 0
multiplicity: 1
keywords: wb97x-d3
keywords: def2-TZVPP
keywords: def2/J RIJCOSX
keywords: DEFGRID2
keywords: scfconv7
keywords: smallprint printgap noloewdin
keywords: NOSOSCF
formula: C9H18NO3PS2
InChI: InChI=1/C9H18NO3PS2/c1-4-8(3)16-14(12,13-5-2)10-6-7-15-9(10)11/h8H,4-7H2,1-3H3
34 atoms
S  1.501119 0.693309 1.093708
S  -3.45578 -0.098215 0.655896
P  0.657011 -0.485291 -0.380768
O  0.935902 -1.92807 0.229576
O  1.079074 -0.209078 -1.771187
O  -1.225642 -0.714086 1.949741
N  -1.052294 -0.337837 -0.304662
C  -1.815481 0.242251 -1.400644
C  2.43193 1.927953 0.079533
C  -3.265636 -0.143396 -1.146302
C  1.724083 3.277189 0.089089
C  -1.721366 -0.442409 0.895993
C  3.839407 2.015402 0.648994
C  0.335458 3.265782 -0.526536
C  0.428032 -3.111105 -0.400118
C  1.387348 -3.638597 -1.443595
H  -1.462197 -0.142333 -2.35421
H  -1.707114 1.32929 -1.411698
H  2.473401 1.540571 -0.939162
H  -3.952022 0.559134 -1.614243
H  -3.487379 -1.145866 -1.512726
H  1.675112 3.655794 1.114027
H  2.359873 3.976564 -0.463399
H  4.425814 2.733357 0.072816
H  4.346705 1.053389 0.607961
H  3.833559 2.351491 1.686669
H  0.354862 2.850772 -1.535784
H  -0.354389 2.671452 0.073782
H  -0.07134 4.274928 -0.587324
H  0.289272 -3.83028 0.406232
H  -0.557795 -2.921147 -0.835907
H  1.00001 -4.568967 -1.860188
H  1.518813 -2.929102 -2.259043
H  2.363957 -3.847827 -1.008663
totalener: -1772.18722573 hartree
nucrepener: 1702.56981756 hartree
electener: -3474.75704329 hartree
oneelecener: -5824.72890452 hartree
twoeener: 2349.97186123 hartree
kineticenergy: 1767.27528691 hartree
xcener: -116.184217702401 hartree
chargesum: 0.0000000
charge: -0.149690 -0.035931 0.747772 -0.306979 -0.536793 -0.325931 -0.190290 -0.103590 0.035320 -0.129610 -0.094897 0.235583 -0.261967 -0.280803 0.018300 -0.236729 0.113809 0.103552 0.092878 0.105079 0.103294 0.069078 0.066013 0.083459 0.103306 0.089816 0.086287 0.072045 0.095474 0.104160 0.067891 0.079550 0.093062 0.087479
qa: -0.1497 -0.0359 0.7478 -0.3070 -0.5368 -0.3259 -0.1903 -0.1036 0.0353 -0.1296 -0.0949 0.2356 -0.2620 -0.2808 0.0183 -0.2367 0.1138 0.1036 0.0929 0.1051 0.1033 0.0691 0.0660 0.0835 0.1033 0.0898 0.0863 0.0720 0.0955 0.1042 0.0679 0.0795 0.0931 0.0875
va: 2.3097 2.3649 5.4383 2.1544 2.0665 2.1606 3.0245 3.9596 3.8276 3.9672 3.8639 4.3278 3.9422 3.9492 3.9290 3.9204 1.0145 1.0015 1.0442 1.0123 1.0053 1.0133 1.0093 1.0037 1.0142 1.0046 1.0026 1.0114 1.0126 0.9900 1.0034 1.0101 1.0187 1.0059
dispcorr: -0.017322069 hartree
energy: -1772.204547800999
dipole: 11.21635 -11.57610 -0.35976 7.39315 -7.23767 0.15548 -11.10866 9.83718 -1.27148
magnitude: 1.33051 au
magnitude: 3.38188 debye
