program: Orca
programVersion: 5.0.4
elementType: S S P O O O N C C C C C C C C C H H H H H H H H H H H H H H H H H H
charge: 0
multiplicity: 1
keywords: wb97x-d3
keywords: def2-TZVPP
keywords: def2/J RIJCOSX
keywords: DEFGRID2
keywords: scfconv7
keywords: smallprint printgap noloewdin
keywords: NOSOSCF
formula: C9H18NO3PS2
InChI: InChI=1/C9H18NO3PS2/c1-4-8(3)16-14(12,13-5-2)10-6-7-15-9(10)11/h8H,4-7H2,1-3H3
34 atoms
S  1.644186 0.201948 0.587286
S  -3.437746 0.229844 0.727566
P  0.41556 -0.625362 -0.868039
O  0.417759 -2.181456 -0.56196
O  0.722433 -0.219495 -2.251699
O  -1.268617 -1.010375 1.602369
N  -1.192682 -0.146723 -0.51963
C  -2.085013 0.365924 -1.548887
C  2.033722 1.818167 -0.212441
C  -3.163029 1.146982 -0.812214
C  0.823353 2.742257 -0.304091
C  -1.779543 -0.424758 0.690008
C  3.182859 2.409312 0.592215
C  0.13297 3.061448 1.012293
C  1.117424 -2.877122 0.478539
C  0.519307 -4.256781 0.600248
H  -2.525302 -0.460023 -2.112942
H  -1.539695 0.996388 -2.247038
H  2.379427 1.588879 -1.220564
H  -2.83701 2.160686 -0.577786
H  -4.084109 1.1985 -1.38885
H  1.169378 3.669549 -0.772447
H  0.104905 2.31635 -1.006744
H  3.447687 3.385563 0.184049
H  4.06733 1.775981 0.544972
H  2.924746 2.547206 1.641795
H  -0.239764 2.161979 1.501802
H  0.797942 3.566618 1.713038
H  -0.716667 3.723713 0.84439
H  2.177508 -2.926757 0.221371
H  1.017195 -2.343039 1.424161
H  1.047191 -4.812867 1.374937
H  -0.530997 -4.199952 0.882752
H  0.602961 -4.814205 -0.331979
totalener: -1772.18625719 hartree
nucrepener: 1719.41226309 hartree
electener: -3491.59852028 hartree
oneelecener: -5858.30441509 hartree
twoeener: 2366.70589481 hartree
kineticenergy: 1767.27643772 hartree
xcener: -116.190737956818 hartree
chargesum: -0.0000000
charge: -0.210558 -0.034860 0.729144 -0.324643 -0.516326 -0.359351 -0.139269 -0.116711 0.071659 -0.123703 -0.141421 0.233211 -0.288439 -0.276642 -0.001488 -0.237607 0.119188 0.113616 0.106579 0.097716 0.111490 0.080268 0.071727 0.089174 0.108399 0.092850 0.095577 0.087672 0.086739 0.111959 0.107702 0.076606 0.092067 0.087675
qa: -0.2106 -0.0349 0.7291 -0.3246 -0.5163 -0.3594 -0.1393 -0.1167 0.0717 -0.1237 -0.1414 0.2332 -0.2884 -0.2766 -0.0015 -0.2376 0.1192 0.1136 0.1066 0.0977 0.1115 0.0803 0.0717 0.0892 0.1084 0.0929 0.0956 0.0877 0.0867 0.1120 0.1077 0.0766 0.0921 0.0877
va: 2.2822 2.3649 5.4817 2.1415 2.1131 2.1246 3.0203 3.9593 3.8766 3.9553 3.8766 4.3244 3.9292 3.9382 3.8663 3.9514 1.0052 1.0060 1.0261 1.0030 1.0134 1.0127 1.0225 1.0023 1.0112 1.0029 1.0068 1.0069 1.0044 0.9935 0.9887 1.0086 1.0092 1.0043
dispcorr: -0.018204515 hartree
energy: -1772.204461704122
dipole: 9.11929 -9.19571 -0.07642 9.70414 -8.89292 0.81122 1.61830 -1.76919 -0.15089
magnitude: 0.82866 au
magnitude: 2.10629 debye
