program: Orca
programVersion: 5.0.4
elementType: S S P O O O N C C C C C C C C C H H H H H H H H H H H H H H H H H H
charge: 0
multiplicity: 1
keywords: wb97x-d3
keywords: def2-TZVPP
keywords: def2/J RIJCOSX
keywords: DEFGRID2
keywords: scfconv7
keywords: smallprint printgap noloewdin
keywords: NOSOSCF
formula: C9H18NO3PS2
InChI: InChI=1/C9H18NO3PS2/c1-4-8(3)16-14(12,13-5-2)10-6-7-15-9(10)11/h8H,4-7H2,1-3H3
34 atoms
S  0.821224 0.49441 1.002116
S  -4.001955 -0.448414 0.434688
P  0.090625 -0.527494 -0.665144
O  0.321791 -2.073064 -0.402086
O  0.549225 0.01854 -1.957157
O  -1.753835 -1.339451 1.518793
N  -1.613126 -0.436795 -0.580435
C  -2.373185 0.426252 -1.469534
C  1.716265 1.886615 0.179051
C  -3.825492 -0.004635 -1.315109
C  1.708583 3.038501 1.182535
C  -2.267342 -0.831123 0.562961
C  3.10524 1.451854 -0.246009
C  2.277087 4.326648 0.601439
C  1.158116 -2.6826 0.584964
C  2.612375 -2.668337 0.177577
H  -2.030246 0.310318 -2.494589
H  -2.254429 1.475074 -1.182689
H  1.13593 2.170696 -0.699546
H  -4.510742 0.801978 -1.566682
H  -4.056054 -0.869668 -1.936205
H  0.682121 3.216207 1.510468
H  2.272321 2.753241 2.07565
H  3.69251 1.117828 0.610437
H  3.638217 2.276363 -0.721952
H  3.052964 0.642736 -0.971668
H  1.744614 4.621401 -0.30416
H  2.180721 5.141785 1.31819
H  3.334133 4.239186 0.352016
H  1.012424 -2.19982 1.551965
H  0.787014 -3.70294 0.672936
H  3.00671 -1.652878 0.140183
H  3.20151 -3.225317 0.906754
H  2.756015 -3.131466 -0.797966
totalener: -1772.18639027 hartree
nucrepener: 1682.13108257 hartree
electener: -3454.31747284 hartree
oneelecener: -5783.88138269 hartree
twoeener: 2329.56390985 hartree
kineticenergy: 1767.27862700 hartree
xcener: -116.188521582386 hartree
chargesum: -0.0000000
charge: -0.202460 -0.034331 0.724739 -0.322936 -0.526374 -0.358877 -0.148727 -0.093891 0.083945 -0.136756 -0.093002 0.255575 -0.313766 -0.269010 0.024877 -0.221078 0.114384 0.098855 0.072520 0.101709 0.106500 0.081700 0.073457 0.088695 0.097242 0.104790 0.080171 0.091173 0.078760 0.096213 0.098199 0.069473 0.083857 0.094371
qa: -0.2025 -0.0343 0.7247 -0.3229 -0.5264 -0.3589 -0.1487 -0.0939 0.0839 -0.1368 -0.0930 0.2556 -0.3138 -0.2690 0.0249 -0.2211 0.1144 0.0989 0.0725 0.1017 0.1065 0.0817 0.0735 0.0887 0.0972 0.1048 0.0802 0.0912 0.0788 0.0962 0.0982 0.0695 0.0839 0.0944
va: 2.2852 2.3707 5.4782 2.1466 2.0906 2.1279 3.1091 3.9626 3.8466 3.9790 3.8395 4.3177 3.9549 3.9539 3.9004 3.9212 1.0101 1.0018 1.0431 1.0118 1.0055 1.0200 1.0128 1.0029 1.0083 1.0170 1.0015 1.0058 1.0034 1.0002 0.9922 1.0102 1.0121 1.0058
dispcorr: -0.016234641 hartree
energy: -1772.202624910836
dipole: 22.18336 -22.04772 0.13565 13.63982 -12.95026 0.68956 -1.21131 0.86432 -0.34699
magnitude: 0.78377 au
magnitude: 1.99219 debye
