program: Orca
programVersion: 5.0.3
elementType: O O N N N C C C C C C C C C C C H H H H H H H H H H H H H H H
charge: 0
multiplicity: 1
keywords: wb97x-d3
keywords: def2-TZVPP
keywords: def2/J RIJCOSX
keywords: DEFGRID2
keywords: scfconv7
keywords: smallprint printgap noloewdin
keywords: NOSOSCF
formula: C11H15N3O2
InChI: InChI=1/C11H15N3O2/c1-12-11(15)16-10-6-4-5-9(7-10)13-8-14(2)3/h4-8,12H,1-3H3
31 atoms
O  2.407863 -0.047045 0.596277
O  3.467389 1.114012 -1.039959
N  -4.418179 -1.30617 0.030497
N  -2.190862 -0.760079 -0.262321
N  4.559616 -0.390345 0.274486
C  -1.167591 0.153254 -0.055378
C  1.181761 0.524706 0.339505
C  0.126289 -0.340247 0.126562
C  -1.355545 1.537787 -0.061243
C  0.994464 1.899749 0.364859
C  -0.283154 2.389329 0.153476
C  -3.327972 -0.547492 0.269411
C  -4.361253 -2.430016 -0.867934
C  -5.617827 -1.151938 0.805349
C  3.483646 0.306288 -0.152049
C  5.853247 -0.279122 -0.344224
H  0.289758 -1.409792 0.109851
H  -2.33481 1.950792 -0.268744
H  1.822016 2.574712 0.525467
H  -0.443054 3.459579 0.142377
H  -3.515531 0.271834 0.971813
H  -4.371352 -3.378582 -0.323097
H  -3.448184 -2.37831 -1.453451
H  -5.2204 -2.416453 -1.541946
H  -6.491808 -1.061467 0.156226
H  -5.561279 -0.252234 1.416249
H  -5.783789 -2.00225 1.474107
H  4.424621 -1.071151 1.000976
H  6.622973 -0.060854 0.396999
H  5.834751 0.534028 -1.063914
H  6.130394 -1.193641 -0.872376
totalener: -742.98642585 hartree
nucrepener: 1038.29463785 hartree
electener: -1781.28106370 hartree
oneelecener: -3070.01564319 hartree
twoeener: 1288.73457949 hartree
kineticenergy: 739.84506545 hartree
xcener: -71.285467742411 hartree
chargesum: 0.0000000
charge: -0.328346 -0.394828 -0.141175 -0.358265 -0.235005 0.206758 0.269590 -0.233101 -0.234784 -0.132911 -0.121655 0.175957 -0.162779 -0.143653 0.447807 -0.149293 0.102676 0.110680 0.108094 0.118471 0.067121 0.093885 0.117063 0.091288 0.096314 0.082810 0.098533 0.140128 0.097894 0.111572 0.099152
qa: -0.3283 -0.3948 -0.1412 -0.3583 -0.2350 0.2068 0.2696 -0.2331 -0.2348 -0.1329 -0.1217 0.1760 -0.1628 -0.1437 0.4478 -0.1493 0.1027 0.1107 0.1081 0.1185 0.0671 0.0939 0.1171 0.0913 0.0963 0.0828 0.0985 0.1401 0.0979 0.1116 0.0992
va: 2.0740 2.1247 3.1745 3.0338 3.1507 3.8925 3.8357 4.1507 3.9849 4.0076 3.9751 4.0312 3.8764 3.9109 4.3269 3.8864 1.0384 1.0116 1.0191 1.0023 1.0267 0.9944 1.0315 0.9956 0.9915 1.0093 0.9874 1.0339 0.9919 1.0225 0.9903
dispcorr: -0.010261638 hartree
energy: -742.996687486084
dipole: -11.18795 10.16132 -1.02662 -6.09413 5.20870 -0.88543 0.55120 0.41091 0.96211
magnitude: 1.66241 au
magnitude: 4.22550 debye
