program: Orca
programVersion: 5.0.3
elementType: O O N N N C C C C C C C C C C C H H H H H H H H H H H H H H H
charge: 0
multiplicity: 1
keywords: wb97x-d3
keywords: def2-TZVPP
keywords: def2/J RIJCOSX
keywords: DEFGRID2
keywords: scfconv7
keywords: smallprint printgap noloewdin
keywords: NOSOSCF
formula: C11H15N3O2
InChI: InChI=1/C11H15N3O2/c1-12-11(15)16-10-6-4-5-9(7-10)13-8-14(2)3/h4-8,12H,1-3H3
31 atoms
O  2.388868 0.381231 -0.793508
O  3.316438 0.203734 1.268707
N  -4.347847 -1.303501 -0.051194
N  -2.26823 -0.452211 -0.587184
N  4.511186 -0.182951 -0.631167
C  -1.208978 0.36929 -0.23033
C  1.164424 0.775413 -0.303211
C  0.075054 -0.006749 -0.629657
C  -1.361428 1.563846 0.478081
C  1.02069 1.949657 0.421575
C  -0.253982 2.332554 0.801319
C  -3.215378 -0.632238 0.245185
C  -4.534988 -1.884334 -1.356005
C  -5.265471 -1.698163 0.982621
C  3.403639 0.13544 0.073335
C  5.747779 -0.55973 -0.000836
H  0.205832 -0.917373 -1.199151
H  -2.351482 1.912634 0.744001
H  1.877292 2.559713 0.66979
H  -0.388133 3.255713 1.349904
H  -3.187265 -0.256279 1.27352
H  -3.925161 -1.353031 -2.080938
H  -5.58417 -1.808542 -1.645706
H  -4.248779 -2.940212 -1.376292
H  -5.058741 -1.148118 1.899558
H  -5.199081 -2.766783 1.209749
H  -6.294109 -1.480907 0.687995
H  4.43076 -0.256991 -1.629868
H  5.763557 -0.183671 1.018247
H  6.589357 -0.123421 -0.537928
H  5.884324 -1.643036 0.034317
totalener: -742.98671396 hartree
nucrepener: 1040.30232074 hartree
electener: -1783.28903470 hartree
oneelecener: -3074.03015302 hartree
twoeener: 1290.74111832 hartree
kineticenergy: 739.85215064 hartree
xcener: -71.285537874532 hartree
chargesum: 0.0000000
charge: -0.329521 -0.392740 -0.146132 -0.360106 -0.238775 0.203923 0.271074 -0.228418 -0.235342 -0.133580 -0.119993 0.179678 -0.161451 -0.143724 0.444633 -0.146847 0.103443 0.109935 0.108271 0.118375 0.070054 0.115040 0.088079 0.097755 0.083654 0.100258 0.094791 0.141430 0.109773 0.096561 0.099903
qa: -0.3295 -0.3927 -0.1461 -0.3601 -0.2388 0.2039 0.2711 -0.2284 -0.2353 -0.1336 -0.1200 0.1797 -0.1615 -0.1437 0.4446 -0.1468 0.1034 0.1099 0.1083 0.1184 0.0701 0.1150 0.0881 0.0978 0.0837 0.1003 0.0948 0.1414 0.1098 0.0966 0.0999
va: 2.0700 2.1278 3.1715 3.0336 3.1489 3.8974 3.8359 4.1428 3.9784 4.0263 3.9718 4.0267 3.8835 3.9122 4.3338 3.8963 1.0379 1.0120 1.0145 1.0021 1.0256 1.0258 0.9966 0.9949 1.0088 0.9859 0.9925 1.0337 1.0175 0.9946 0.9889
dispcorr: -0.010318536 hartree
energy: -742.997032499947
dipole: -10.51314 9.68088 -0.83226 -6.91205 6.27297 -0.63908 0.64471 -0.99940 -0.35469
magnitude: 1.10765 au
magnitude: 2.81541 debye
