program: Orca
programVersion: 5.0.3
elementType: O O N N N C C C C C C C C C C C H H H H H H H H H H H H H H H
charge: 0
multiplicity: 1
keywords: wb97x-d3
keywords: def2-TZVPP
keywords: def2/J RIJCOSX
keywords: DEFGRID2
keywords: scfconv7
keywords: smallprint printgap noloewdin
keywords: NOSOSCF
formula: C11H15N3O2
InChI: InChI=1/C11H15N3O2/c1-12-11(15)16-10-6-4-5-9(7-10)13-8-14(2)3/h4-8,12H,1-3H3
31 atoms
O  2.17267 0.4513 -0.851639
O  2.984133 -0.013508 1.212297
N  -3.778795 -1.699931 -0.179508
N  -2.587306 0.277534 -0.197113
N  4.138973 -0.532148 -0.681475
C  -1.360725 0.910185 -0.060799
C  1.030787 1.024804 -0.33358
C  -0.16137 0.343584 -0.500031
C  -1.323453 2.181991 0.514479
C  1.073554 2.273328 0.258635
C  -0.120459 2.843738 0.677211
C  -2.666736 -0.969762 0.04752
C  -4.967037 -1.069072 -0.694748
C  -3.922574 -3.014146 0.386117
C  3.094239 -0.036348 0.017312
C  5.245381 -1.197159 -0.047048
H  -0.158257 -0.614051 -1.006291
H  -2.25223 2.632757 0.836521
H  2.012491 2.79578 0.378173
H  -0.107631 3.822923 1.137396
H  -1.836585 -1.552013 0.462351
H  -4.691198 -0.223305 -1.318531
H  -5.617448 -0.703322 0.105794
H  -5.530369 -1.786212 -1.293306
H  -4.564872 -3.016996 1.27278
H  -2.949468 -3.406881 0.6778
H  -4.354434 -3.700697 -0.344336
H  4.073195 -0.545873 -1.684239
H  6.17584 -0.935039 -0.548969
H  5.140959 -2.284688 -0.058615
H  5.315969 -0.875516 0.988162
totalener: -742.98655794 hartree
nucrepener: 1049.35123091 hartree
electener: -1792.33778886 hartree
oneelecener: -3092.05907496 hartree
twoeener: 1299.72128610 hartree
kineticenergy: 739.85606408 hartree
xcener: -71.284742014464 hartree
chargesum: -0.0000000
charge: -0.336035 -0.392166 -0.149114 -0.355188 -0.239830 0.202885 0.255728 -0.244656 -0.216741 -0.144790 -0.090394 0.175818 -0.158801 -0.144696 0.441368 -0.147423 0.104969 0.107988 0.109073 0.117525 0.077917 0.113686 0.099629 0.086103 0.100635 0.084238 0.094436 0.141359 0.097239 0.098761 0.110475
qa: -0.3360 -0.3922 -0.1491 -0.3552 -0.2398 0.2029 0.2557 -0.2447 -0.2167 -0.1448 -0.0904 0.1758 -0.1588 -0.1447 0.4414 -0.1474 0.1050 0.1080 0.1091 0.1175 0.0779 0.1137 0.0996 0.0861 0.1006 0.0842 0.0944 0.1414 0.0972 0.0988 0.1105
va: 2.0610 2.1282 3.1653 3.0358 3.1461 3.8940 3.8389 4.0610 4.0727 4.0524 3.9415 4.0212 3.8889 3.9131 4.3365 3.8977 1.0202 1.0288 1.0087 1.0000 1.0232 1.0217 0.9957 0.9971 0.9855 1.0085 0.9929 1.0333 0.9950 0.9889 1.0167
dispcorr: -0.010442123 hartree
energy: -742.997000064364
dipole: -8.24955 7.98372 -0.26583 -10.30879 8.87935 -1.42945 0.02843 -0.71839 -0.68996
magnitude: 1.60935 au
magnitude: 4.09065 debye
