program: Orca
programVersion: 5.0.2
elementType: S S P O O O C C C C C C C C C C H H H H H H H H H H H H H H H
charge: 0
multiplicity: 1
keywords: wb97x-d3
keywords: def2-TZVPP
keywords: def2/J RIJCOSX
keywords: DEFGRID2
keywords: scfconv7
keywords: smallprint printgap noloewdin
keywords: NOSOSCF
formula: C10H15O3PS2
InChI: InChI=1/C10H15O3PS2/c1-8-7-9(5-6-10(8)16-4)13-14(15,11-2)12-3/h5-7H,1-4H3
31 atoms
S  -4.502539 0.171116 -0.684942
S  4.05335 -1.16565 0.516753
P  2.410574 -0.304212 0.045398
O  1.15136 -1.279314 0.302483
O  2.075378 1.072116 0.778897
O  2.179324 0.095596 -1.478554
C  -2.206776 0.081331 0.883545
C  -0.157081 -0.887476 0.062022
C  -2.798394 -0.196445 -0.357057
C  -0.871191 -0.265156 1.069923
C  -0.738958 -1.183498 -1.157147
C  -2.063989 -0.832147 -1.354749
C  -2.949289 0.743166 2.001637
C  -4.444201 1.973046 -0.865388
C  2.366595 1.283489 2.165552
C  3.08569 0.988444 -2.140446
H  -0.39728 -0.069337 2.024516
H  -0.177948 -1.685283 -1.934106
H  -2.532632 -1.050592 -2.3051
H  -2.480039 0.529358 2.960842
H  -2.957627 1.828356 1.880981
H  -3.987868 0.416678 2.042998
H  -3.761019 2.262929 -1.660978
H  -4.159057 2.465239 0.061975
H  -5.448808 2.298474 -1.132392
H  3.409775 1.057428 2.385811
H  1.72203 0.673637 2.798501
H  2.176022 2.33436 2.366737
H  2.957991 2.00812 -1.77904
H  2.846675 0.948969 -3.199251
H  4.120684 0.677201 -1.995843
elementType: S P O C H
totalener: -1753.69821940 hartree
nucrepener: 1542.38170862 hartree
electener: -3296.07992802 hartree
oneelecener: -5479.69522294 hartree
twoeener: 2183.61529492 hartree
cpcmener: -0.02458503 hartree
kineticenergy: 1748.83401460 hartree
xcener: -114.447686600541 hartree
chargesum: -0.0000000
charge: -0.136182 -0.439532 0.725158 -0.352130 -0.337262 -0.331470 0.020217 0.266569 -0.021070 -0.195848 -0.226810 -0.096935 -0.240860 -0.270913 -0.103768 -0.104292 0.157113 0.150966 0.132467 0.102646 0.110907 0.101383 0.118774 0.118775 0.125961 0.115093 0.121957 0.131853 0.125082 0.127597 0.104555
qa: -0.1362 -0.4395 0.7252 -0.3521 -0.3373 -0.3315 0.0202 0.2666 -0.0211 -0.1958 -0.2268 -0.0969 -0.2409 -0.2709 -0.1038 -0.1043 0.1571 0.1510 0.1325 0.1026 0.1109 0.1014 0.1188 0.1188 0.1260 0.1151 0.1220 0.1319 0.1251 0.1276 0.1046
va: 2.2286 2.0182 5.5212 2.1112 2.0585 2.0964 3.6891 3.7218 3.7490 4.0146 4.0452 3.9430 3.8735 3.9643 3.8187 3.8383 0.9915 1.0037 1.0158 1.0055 0.9890 1.0158 0.9995 0.9957 0.9987 1.0071 0.9847 0.9894 0.9906 0.9890 1.0019
dispcorr: -0.014023913 hartree
energy: -1753.712243308116
dipole: -10.59930 9.98092 -0.61838 14.45512 -11.94966 2.50545 2.51281 -2.32398 0.18883
magnitude: 2.58754 au
magnitude: 6.57699 debye
