program: Orca
programVersion: 5.0.2
elementType: S S P O O O C C C C C C C C C C H H H H H H H H H H H H H H H
charge: 0
multiplicity: 1
keywords: wb97x-d3
keywords: def2-TZVPP
keywords: def2/J RIJCOSX
keywords: DEFGRID2
keywords: scfconv7
keywords: smallprint printgap noloewdin
keywords: NOSOSCF
formula: C10H15O3PS2
InChI: InChI=1/C10H15O3PS2/c1-8-7-9(5-6-10(8)16-4)13-14(15,11-2)12-3/h5-7H,1-4H3
31 atoms
S  -4.417042 -0.886986 -0.344872
S  2.499234 -1.705767 -0.573218
P  2.425409 0.082622 0.110487
O  1.193826 1.00098 -0.394344
O  2.28874 0.252447 1.686764
O  3.6503 1.042743 -0.219543
C  -2.232766 0.418413 0.771363
C  -0.111257 0.538266 -0.370055
C  -2.746261 -0.289766 -0.324471
C  -0.903065 0.828654 0.727903
C  -0.607321 -0.168411 -1.449958
C  -1.931147 -0.576492 -1.415265
C  -3.066144 0.744873 1.971347
C  -5.324131 0.624629 -0.763414
C  3.023348 -0.582637 2.591538
C  4.217893 1.104351 -1.534245
H  -0.48661 1.384657 1.558851
H  0.018666 -0.389682 -2.303419
H  -2.337379 -1.126459 -2.253677
H  -2.448307 1.127461 2.781971
H  -3.812847 1.506687 1.742083
H  -3.605093 -0.129675 2.33392
H  -5.243489 1.376605 0.018941
H  -6.372796 0.349531 -0.868476
H  -4.976305 1.03752 -1.707953
H  2.833302 -1.636492 2.393288
H  2.675265 -0.336119 3.590328
H  4.092195 -0.384634 2.523337
H  3.496193 1.487584 -2.254727
H  4.569372 0.124542 -1.854999
H  5.060973 1.786677 -1.475168
elementType: S P O C H
totalener: -1753.69809137 hartree
nucrepener: 1534.63673369 hartree
electener: -3288.33482507 hartree
oneelecener: -5464.82495832 hartree
twoeener: 2176.49013325 hartree
cpcmener: -0.02109454 hartree
kineticenergy: 1748.84464063 hartree
xcener: -114.449738623249 hartree
chargesum: -0.0000000
charge: -0.140146 -0.454691 0.775359 -0.360508 -0.344923 -0.342245 0.033629 0.277607 -0.034536 -0.185662 -0.224973 -0.098097 -0.227698 -0.270788 -0.115257 -0.111185 0.137510 0.146567 0.131809 0.099639 0.108337 0.101326 0.117193 0.125965 0.118296 0.111387 0.129217 0.128758 0.127892 0.109123 0.131095
qa: -0.1401 -0.4547 0.7754 -0.3605 -0.3449 -0.3422 0.0336 0.2776 -0.0345 -0.1857 -0.2250 -0.0981 -0.2277 -0.2708 -0.1153 -0.1112 0.1375 0.1466 0.1318 0.0996 0.1083 0.1013 0.1172 0.1260 0.1183 0.1114 0.1292 0.1288 0.1279 0.1091 0.1311
va: 2.2193 1.9864 5.4901 2.0949 2.1107 2.0985 3.6720 3.6939 3.7751 4.0354 4.0349 3.9520 3.8837 3.9672 3.8417 3.8360 1.0170 1.0085 1.0158 1.0065 0.9909 1.0095 0.9959 0.9987 0.9987 1.0006 0.9901 0.9860 0.9862 1.0009 0.9903
dispcorr: -0.013489900 hartree
energy: -1753.711581273117
dipole: -8.37024 8.67135 0.30111 6.10906 -4.66909 1.43997 4.00760 -3.63598 0.37162
magnitude: 1.51732 au
magnitude: 3.85673 debye
