program: Orca
programVersion: 5.0.2
elementType: S S P O O O C C C C C C C C C C H H H H H H H H H H H H H H H
charge: 0
multiplicity: 1
keywords: wb97x-d3
keywords: def2-TZVPP
keywords: def2/J RIJCOSX
keywords: DEFGRID2
keywords: scfconv7
keywords: smallprint printgap noloewdin
keywords: NOSOSCF
formula: C10H15O3PS2
InChI: InChI=1/C10H15O3PS2/c1-8-7-9(5-6-10(8)16-4)13-14(15,11-2)12-3/h5-7H,1-4H3
31 atoms
S  -4.482925 -0.316577 -0.194516
S  2.060584 0.160026 -2.066358
P  2.433649 -0.056837 -0.202155
O  1.289715 0.485699 0.814288
O  2.697116 -1.572427 0.189754
O  3.703667 0.687071 0.406861
C  -2.143774 1.031749 -0.342204
C  -0.05326 0.253352 0.569809
C  -2.759584 -0.141994 0.126654
C  -0.78681 1.209697 -0.112537
C  -0.650913 -0.902513 1.031495
C  -2.008442 -1.092288 0.811227
C  -2.924713 2.074778 -1.080312
C  -4.896859 -1.893478 0.565857
C  3.113465 -1.977102 1.504877
C  3.8596 2.105457 0.274537
H  -0.298684 2.108674 -0.467839
H  -0.07916 -1.64784 1.569866
H  -2.46439 -1.998347 1.184415
H  -3.38221 1.670437 -1.985982
H  -3.733226 2.480182 -0.467953
H  -2.285867 2.90528 -1.375943
H  -4.353852 -2.722006 0.114278
H  -5.960024 -2.043248 0.38437
H  -4.732074 -1.884114 1.641935
H  2.955385 -3.050558 1.560348
H  2.527779 -1.4928 2.285495
H  4.170382 -1.762119 1.652699
H  4.874989 2.340038 0.581505
H  3.156967 2.633971 0.917856
H  3.717166 2.421806 -0.759156
elementType: S P O C H
totalener: -1753.70191473 hartree
nucrepener: 1540.12774914 hartree
electener: -3293.82966386 hartree
oneelecener: -5475.76989226 hartree
twoeener: 2181.94022840 hartree
cpcmener: -0.02655829 hartree
kineticenergy: 1748.82408623 hartree
xcener: -114.451212787100 hartree
chargesum: 0.0000000
charge: -0.073922 -0.439663 0.738792 -0.363206 -0.350665 -0.339675 0.027978 0.251950 -0.023247 -0.175634 -0.209670 -0.169444 -0.226909 -0.273137 -0.124062 -0.103473 0.129626 0.159101 0.147085 0.100772 0.102071 0.096059 0.121043 0.133846 0.122716 0.131034 0.122852 0.127911 0.129984 0.126026 0.103859
qa: -0.0739 -0.4397 0.7388 -0.3632 -0.3507 -0.3397 0.0280 0.2520 -0.0232 -0.1756 -0.2097 -0.1694 -0.2269 -0.2731 -0.1241 -0.1035 0.1296 0.1591 0.1471 0.1008 0.1021 0.0961 0.1210 0.1338 0.1227 0.1310 0.1229 0.1279 0.1300 0.1260 0.1039
va: 2.3863 2.0128 5.5074 2.0427 2.1023 2.0826 3.6797 3.7003 3.9318 4.0057 4.0694 3.8913 3.8879 3.9879 3.8387 3.8331 1.0143 0.9915 0.9986 1.0004 1.0006 1.0074 0.9952 0.9992 0.9952 0.9887 0.9894 0.9937 0.9891 0.9902 1.0031
dispcorr: -0.013666034 hartree
energy: -1753.715580760995
dipole: -7.68890 7.66611 -0.02279 0.25703 -0.47826 -0.22123 7.10840 -4.82755 2.28085
magnitude: 2.29167 au
magnitude: 5.82495 debye
