program: Orca
programVersion: 5.0.2
elementType: S S P O O O C C C C C C C C C C H H H H H H H H H H H H H H H
charge: 0
multiplicity: 1
keywords: wb97x-d3
keywords: def2-TZVPP
keywords: def2/J RIJCOSX
keywords: DEFGRID2
keywords: scfconv7
keywords: smallprint printgap noloewdin
keywords: NOSOSCF
formula: C10H15O3PS2
InChI: InChI=1/C10H15O3PS2/c1-8-7-9(5-6-10(8)16-4)13-14(15,11-2)12-3/h5-7H,1-4H3
31 atoms
S  -4.492769 -0.184503 -0.056564
S  2.098228 -1.98803 -0.620437
P  2.418527 -0.247834 0.108202
O  1.319453 0.885094 -0.269035
O  2.514707 -0.258951 1.693551
O  3.751015 0.516963 -0.315264
C  -2.111728 0.561747 0.991239
C  -0.036579 0.606377 -0.23297
C  -2.760893 0.111123 -0.170937
C  -0.744098 0.802173 0.941463
C  -0.668989 0.166221 -1.3784
C  -2.034043 -0.07471 -1.343406
C  -2.867557 0.775126 2.26633
C  -4.898888 -0.899566 -1.655072
C  2.840467 0.920439 2.45195
C  4.04909 0.761245 -1.696342
H  -0.233828 1.15385 1.830761
H  -0.112148 0.016756 -2.293594
H  -2.515704 -0.414501 -2.249172
H  -2.204986 1.111823 3.061927
H  -3.652772 1.525778 2.151672
H  -3.351883 -0.14385 2.604263
H  -5.956475 -1.155015 -1.610721
H  -4.335173 -1.81154 -1.845962
H  -4.753663 -0.196211 -2.473291
H  3.913949 1.099601 2.429006
H  2.529886 0.724734 3.474398
H  2.313765 1.800818 2.085624
H  3.405242 1.542429 -2.099062
H  3.93584 -0.146239 -2.289972
H  5.083677 1.089835 -1.741281
elementType: S P O C H
totalener: -1753.70174428 hartree
nucrepener: 1541.55823574 hartree
electener: -3295.25998002 hartree
oneelecener: -5478.57904617 hartree
twoeener: 2183.31906615 hartree
cpcmener: -0.02643220 hartree
kineticenergy: 1748.82594056 hartree
xcener: -114.451441680115 hartree
chargesum: -0.0000000
charge: -0.073789 -0.438927 0.737888 -0.363626 -0.352032 -0.339517 0.016140 0.253246 -0.032734 -0.156231 -0.227166 -0.151570 -0.231836 -0.273201 -0.125535 -0.101605 0.149153 0.143500 0.148294 0.095494 0.102294 0.101860 0.134022 0.122618 0.121223 0.129369 0.131261 0.122687 0.125143 0.104018 0.129561
qa: -0.0738 -0.4389 0.7379 -0.3636 -0.3520 -0.3395 0.0161 0.2532 -0.0327 -0.1562 -0.2272 -0.1516 -0.2318 -0.2732 -0.1255 -0.1016 0.1492 0.1435 0.1483 0.0955 0.1023 0.1019 0.1340 0.1226 0.1212 0.1294 0.1313 0.1227 0.1251 0.1040 0.1296
va: 2.3870 2.0141 5.5063 2.0436 2.0995 2.0822 3.7042 3.6981 3.9342 3.9959 4.0724 3.8625 3.8924 3.9868 3.8387 3.8322 0.9940 1.0073 0.9957 1.0079 0.9976 1.0022 0.9992 0.9965 0.9943 0.9936 0.9887 0.9898 0.9908 1.0034 0.9891
dispcorr: -0.013701818 hartree
energy: -1753.715446101095
dipole: -7.67057 7.63545 -0.03512 6.49418 -4.70088 1.79330 0.79053 -1.06182 -0.27129
magnitude: 1.81404 au
magnitude: 4.61093 debye
