program: Orca
programVersion: 5.0.2
elementType: S S P O O O C C C C C C C C C C H H H H H H H H H H H H H H H
charge: 0
multiplicity: 1
keywords: wb97x-d3
keywords: def2-TZVPP
keywords: def2/J RIJCOSX
keywords: DEFGRID2
keywords: scfconv7
keywords: smallprint printgap noloewdin
keywords: NOSOSCF
formula: C10H15O3PS2
InChI: InChI=1/C10H15O3PS2/c1-8-7-9(5-6-10(8)16-4)13-14(15,11-2)12-3/h5-7H,1-4H3
31 atoms
S  -4.472445 0.412308 -1.041702
S  2.067694 -1.861294 -0.374599
P  2.438155 -0.051344 0.130489
O  1.180887 0.818318 0.65457
O  3.469069 0.178282 1.321868
O  3.014168 0.931344 -0.981858
C  -2.445854 0.539855 0.862153
C  -0.119742 0.670649 0.222844
C  -2.786067 0.469898 -0.496694
C  -1.098697 0.623038 1.200727
C  -0.449114 0.621421 -1.120856
C  -1.787214 0.513047 -1.46479
C  -3.474285 0.515817 1.949256
C  -4.932648 -1.290879 -0.631138
C  3.48142 -0.680597 2.468594
C  4.075547 0.51475 -1.851406
H  -0.809639 0.671496 2.243691
H  0.304693 0.677967 -1.89477
H  -2.057269 0.464469 -2.511345
H  -4.345586 1.115976 1.688747
H  -3.829618 -0.499143 2.137595
H  -3.061926 0.892386 2.883911
H  -4.949393 -1.462172 0.443172
H  -4.260002 -2.002035 -1.106383
H  -5.937913 -1.451265 -1.019051
H  4.295648 -0.338646 3.101392
H  3.659973 -1.715508 2.178801
H  2.544391 -0.61245 3.021006
H  4.229845 1.32347 -2.560212
H  3.805032 -0.391355 -2.392937
H  4.995626 0.344996 -1.292967
elementType: S P O C H
totalener: -1753.69808306 hartree
nucrepener: 1529.82143025 hartree
electener: -3283.51951331 hartree
oneelecener: -5455.08087377 hartree
twoeener: 2171.56136046 hartree
cpcmener: -0.02182649 hartree
kineticenergy: 1748.83388356 hartree
xcener: -114.449730965186 hartree
chargesum: 0.0000000
charge: -0.137590 -0.450683 0.767988 -0.335239 -0.347163 -0.345123 0.029826 0.237262 -0.022283 -0.176292 -0.200440 -0.115685 -0.232336 -0.271010 -0.115305 -0.114986 0.136110 0.144496 0.131748 0.100854 0.110364 0.101487 0.117141 0.118733 0.126382 0.131160 0.111512 0.127166 0.131367 0.110722 0.129819
qa: -0.1376 -0.4507 0.7680 -0.3352 -0.3472 -0.3451 0.0298 0.2373 -0.0223 -0.1763 -0.2004 -0.1157 -0.2323 -0.2710 -0.1153 -0.1150 0.1361 0.1445 0.1317 0.1009 0.1104 0.1015 0.1171 0.1187 0.1264 0.1312 0.1115 0.1272 0.1314 0.1107 0.1298
va: 2.2297 1.9815 5.4752 2.1218 2.0989 2.0891 3.6762 3.7453 3.7437 3.9885 3.9821 3.9905 3.8714 3.9653 3.8402 3.8344 1.0108 1.0127 1.0182 1.0141 0.9896 1.0058 0.9960 0.9995 0.9983 0.9909 1.0002 0.9849 0.9900 1.0008 0.9889
dispcorr: -0.013418371 hartree
energy: -1753.711501434549
dipole: -7.12587 7.83478 0.70891 -3.14405 2.82908 -0.31497 4.87796 -4.05149 0.82647
magnitude: 1.13350 au
magnitude: 2.88112 debye
