program: Orca
programVersion: 5.0.2
elementType: S S P O O O C C C C C C C C C C H H H H H H H H H H H H H H H
charge: 0
multiplicity: 1
keywords: wb97x-d3
keywords: def2-TZVPP
keywords: def2/J RIJCOSX
keywords: DEFGRID2
keywords: scfconv7
keywords: smallprint printgap noloewdin
keywords: NOSOSCF
formula: C10H15O3PS2
InChI: InChI=1/C10H15O3PS2/c1-8-7-9(5-6-10(8)16-4)13-14(15,11-2)12-3/h5-7H,1-4H3
31 atoms
S  -4.511401 0.168612 -0.687763
S  4.046156 -1.173777 0.507339
P  2.404382 -0.304212 0.050372
O  1.14153 -1.27343 0.303042
O  2.076272 1.066509 0.799943
O  2.167132 0.112416 -1.467778
C  -2.215725 0.081235 0.882417
C  -0.162747 -0.884898 0.062367
C  -2.806919 -0.198695 -0.357859
C  -0.879527 -0.262334 1.068727
C  -0.74574 -1.183648 -1.155824
C  -2.071026 -0.834304 -1.354216
C  -2.959245 0.743794 1.999702
C  -4.451883 1.968603 -0.884242
C  2.410051 1.278163 2.174056
C  3.078082 0.995248 -2.131319
H  -0.405635 -0.06502 2.023151
H  -0.184269 -1.686904 -1.931815
H  -2.539727 -1.055981 -2.3041
H  -2.491516 0.530884 2.959653
H  -2.968009 1.828883 1.880238
H  -3.997456 0.417019 2.042054
H  -3.770568 2.25286 -1.684027
H  -4.164662 2.470061 0.037959
H  -5.456961 2.293991 -1.151553
H  3.470094 1.09656 2.354254
H  1.81831 0.637053 2.828872
H  2.182113 2.319021 2.392582
H  2.955414 2.018637 -1.776912
H  2.841852 0.952106 -3.191232
H  4.112458 0.681433 -1.984705
elementType: S P O C H
totalener: -1753.70790434 hartree
nucrepener: 1541.92264024 hartree
electener: -3295.63054457 hartree
oneelecener: -5478.70033171 hartree
twoeener: 2183.06978713 hartree
cpcmener: -0.02089430 hartree
kineticenergy: 1748.83873553 hartree
xcener: -114.448595438060 hartree
chargesum: -0.0000000
charge: -0.131257 -0.432013 0.715285 -0.343245 -0.333194 -0.323775 0.021410 0.266872 -0.025254 -0.188993 -0.220886 -0.093603 -0.241476 -0.271861 -0.108134 -0.106363 0.147150 0.147161 0.130817 0.101043 0.108867 0.102528 0.118075 0.116324 0.124960 0.116489 0.120033 0.130154 0.122935 0.125500 0.104452
qa: -0.1313 -0.4320 0.7153 -0.3432 -0.3332 -0.3238 0.0214 0.2669 -0.0253 -0.1890 -0.2209 -0.0936 -0.2415 -0.2719 -0.1081 -0.1064 0.1471 0.1472 0.1308 0.1010 0.1089 0.1025 0.1181 0.1163 0.1250 0.1165 0.1200 0.1302 0.1229 0.1255 0.1045
va: 2.2300 2.0246 5.5306 2.1214 2.0603 2.1034 3.6867 3.7337 3.7621 4.0188 4.0452 3.9419 3.8752 3.9671 3.8258 3.8438 0.9956 1.0048 1.0160 1.0059 0.9893 1.0157 0.9994 0.9957 0.9992 1.0069 0.9848 0.9895 0.9906 0.9893 1.0023
dispcorr: -0.013991257 hartree
energy: -1753.721895592198
dipole: -10.46600 9.91231 -0.55369 14.45537 -12.05984 2.39553 2.47937 -2.32594 0.15343
magnitude: 2.46347 au
magnitude: 6.26164 debye
