program: Orca
programVersion: 5.0.2
elementType: S S P O O O C C C C C C C C C C H H H H H H H H H H H H H H H
charge: 0
multiplicity: 1
keywords: wb97x-d3
keywords: def2-TZVPP
keywords: def2/J RIJCOSX
keywords: DEFGRID2
keywords: scfconv7
keywords: smallprint printgap noloewdin
keywords: NOSOSCF
formula: C10H15O3PS2
InChI: InChI=1/C10H15O3PS2/c1-8-7-9(5-6-10(8)16-4)13-14(15,11-2)12-3/h5-7H,1-4H3
31 atoms
S  -4.312672 1.259994 0.467854
S  3.930102 -1.291883 -0.885918
P  2.410204 -0.390386 -0.155368
O  1.06849 -0.738143 -0.979446
O  1.946786 -0.748085 1.324914
O  2.491761 1.202405 -0.071855
C  -2.281204 -0.63939 0.502916
C  -0.173244 -0.254474 -0.606512
C  -2.708748 0.620475 0.059711
C  -1.00194 -1.06185 0.151997
C  -0.582797 0.995797 -1.033507
C  -1.856697 1.420964 -0.695761
C  -3.151239 -1.546657 1.316897
C  -5.355764 0.305638 -0.663854
C  2.842142 -0.589572 2.431118
C  3.196278 1.987593 -1.035952
H  -0.651171 -2.035249 0.473326
H  0.063358 1.61948 -1.637353
H  -2.196739 2.391622 -1.032105
H  -3.813195 -0.98802 1.977073
H  -3.781884 -2.165563 0.675223
H  -2.550425 -2.222682 1.923911
H  -5.312334 -0.761428 -0.452973
H  -5.075418 0.48568 -1.700137
H  -6.38197 0.642008 -0.518198
H  3.029064 0.464805 2.635553
H  3.789642 -1.098452 2.248738
H  2.357444 -1.039781 3.293628
H  3.303979 2.981992 -0.610118
H  2.637945 2.053617 -1.969631
H  4.184889 1.574234 -1.235551
elementType: S P O C H
totalener: -1753.70776702 hartree
nucrepener: 1536.98177282 hartree
electener: -3290.68953983 hartree
oneelecener: -5469.02805468 hartree
twoeener: 2178.33851485 hartree
cpcmener: -0.02001729 hartree
kineticenergy: 1748.84322386 hartree
xcener: -114.449534661251 hartree
chargesum: -0.0000000
charge: -0.134966 -0.431123 0.717069 -0.345974 -0.321004 -0.334205 0.050001 0.262595 -0.022693 -0.198396 -0.209370 -0.114520 -0.237463 -0.271488 -0.108358 -0.102642 0.130232 0.155444 0.128956 0.101923 0.108368 0.103470 0.115738 0.117904 0.124910 0.123016 0.105773 0.125092 0.127829 0.120149 0.113731
qa: -0.1350 -0.4311 0.7171 -0.3460 -0.3210 -0.3342 0.0500 0.2626 -0.0227 -0.1984 -0.2094 -0.1145 -0.2375 -0.2715 -0.1084 -0.1026 0.1302 0.1554 0.1290 0.1019 0.1084 0.1035 0.1157 0.1179 0.1249 0.1230 0.1058 0.1251 0.1278 0.1201 0.1137
va: 2.2208 2.0262 5.5278 2.1204 2.1034 2.0634 3.6329 3.7399 3.7648 4.0150 4.0445 3.9805 3.8706 3.9700 3.8468 3.8253 1.0158 0.9915 1.0180 1.0180 0.9895 1.0041 0.9959 0.9989 0.9994 0.9903 1.0006 0.9894 0.9896 0.9851 1.0083
dispcorr: -0.013860068 hartree
energy: -1753.721627084686
dipole: -12.14687 11.45490 -0.69197 2.17095 -1.37760 0.79335 4.19246 -3.71627 0.47619
magnitude: 1.15542 au
magnitude: 2.93684 debye
