program: Gaussian 09
title: 000065755
version: EM64L-G09RevD.01
frameworkgroup: C1[X(C13H12N8O4S3)]
method: RPBEPBE
basis: SDD
operation: Freq
keyword: #p
keyword: freq=noraman
keyword: PBEPBE/SDD
title: #p freq=noraman PBEPBE/SDD
converged: YES YES NO NO
title: Mulliken charges:
elementType: S S S O O O O N N N N N N N N C C C C C C C C C C C C C H H H H H H H H H H H H
charge: 0.213479 0.356546 0.300910 -0.144569 -0.402205 -0.237831 -0.259572 -0.160295 -0.372055 -0.130132 -0.039030 -0.069356 -0.116962 -0.090990 -0.003284 -0.492359 -0.175283 0.118929 0.176033 0.458420 -0.842464 -0.863696 0.127102 0.301277 -0.502505 -0.427022 -0.104146 -0.415590 0.331174 0.316009 0.293242 0.359671 0.330448 0.310107 0.319046 0.264222 0.279299 0.395181 0.315070 0.283181
chargesum: 0.00000
title: Mulliken charges with hydrogens summed into heavy atoms:
elementType: S S S O O O O N N N N N N N N C C C C C C C C C C C C C
charge: 0.213479 0.356546 0.300910 -0.144569 -0.007024 -0.237831 -0.259572 -0.160295 -0.041607 -0.130132 -0.039030 -0.069356 -0.116962 -0.090990 -0.003284 -0.161185 0.140726 0.118929 0.176033 0.458420 -0.189551 -0.234543 0.127102 0.301277 0.041017 -0.427022 0.210924 -0.132408
polarizability: 3.40465864e+02 -3.53170051e+01 2.94973542e+02 -2.61343704e+01 -1.33853897e+01 1.77444131e+02
1716.lowfreq: -9.1394 -3.5083 -2.0246 -0.0016 -0.0009 0.0015 7.4296 15.0314 20.2225
frequency: 4.2133 14.7927 20.1935 27.6258 34.2890 41.1980 54.1358 58.1991 70.8842 79.1600 89.5560 102.0996 115.7721 125.2936 149.5931 157.0845 189.6942 207.3281 209.0162 238.3503 255.9848 267.9773 291.4280 296.8661 315.2773 341.5651 360.0333 394.4854 404.6690 419.7058 458.1167 471.6240 497.7162 505.8809 525.5891 540.7254 565.7917 575.6697 590.1512 597.8414 611.6736 614.9887 620.4024 630.3354 644.7064 667.0180 675.7830 689.1646 706.2220 730.7989 740.4449 758.1001 779.6651 797.4175 819.9539 824.6906 846.8673 863.8042 879.2931 890.0257 909.9044 927.2344 943.3740 958.8087 960.8637 966.3760 977.0513 1001.8310 1022.7378 1059.0063 1072.0116 1095.2138 1114.4472 1145.4192 1154.7838 1162.5982 1175.8989 1180.2891 1185.0720 1218.8344 1223.0216 1236.0434 1243.8529 1253.8064 1260.9837 1295.5297 1298.3960 1316.8740 1324.9197 1332.2484 1373.6900 1381.1341 1391.3235 1411.2982 1431.8799 1438.9587 1457.6772 1493.5243 1604.4150 1623.1994 1633.0694 1738.3077 2980.7384 3002.1101 3041.0435 3058.6299 3061.8363 3084.1242 3085.2802 3142.9301 3236.3275 3283.1475 3528.3247 3532.9974
redmass: 7.9618 9.6224 11.4893 8.6459 14.4926 10.4572 9.0910 6.9996 8.2225 10.2120 9.7847 11.0872 9.4528 7.1637 8.1057 9.4060 3.4845 7.6743 7.1045 6.3551 6.4699 9.1993 3.6523 6.1463 7.7013 7.7542 3.1802 6.3854 7.9604 9.2907 4.7902 4.4562 3.9128 6.9818 3.0477 4.2048 4.0399 13.2565 10.1645 2.3210 1.6014 3.1648 6.2650 4.0000 4.2317 4.5369 9.6620 5.4626 4.9919 5.5005 7.7947 1.2242 6.0533 4.5022 1.7247 6.0790 5.9576 2.2854 2.1484 4.1771 4.3272 3.6422 8.0147 4.8319 7.8428 3.9718 3.9727 5.5209 6.3196 4.0157 4.7394 2.1293 2.1405 1.6931 2.4674 2.6716 1.4553 1.2618 1.2220 1.5003 1.5682 1.6291 1.2370 1.4803 1.3617 1.5343 2.0016 2.0132 6.4260 2.6788 2.1513 8.7725 6.0544 3.0307 1.1064 1.1211 1.2380 1.9210 7.4873 8.2597 7.0608 12.8542 1.0587 1.0637 1.1038 1.0583 1.0844 1.0898 1.0979 1.1081 1.0964 1.1015 1.0782 1.0645
irintensity: 3.1132 0.0347 0.6699 2.2759 6.4024 1.7510 8.1665 5.3727 5.2657 2.4445 2.1486 2.8195 4.4250 1.9807 8.1804 4.4154 8.0155 13.5064 2.6907 3.6922 1.6866 0.5170 6.2733 2.2551 4.2945 8.3686 8.3703 17.2840 4.8657 1.9042 7.9531 5.8445 31.0491 4.7312 22.7842 6.1196 12.5169 0.7461 7.3997 33.4719 53.1653 62.9258 48.7305 6.1309 33.8839 45.0366 3.5175 18.3442 5.0666 7.3442 5.5262 41.3276 20.0817 1.3734 26.6180 27.4931 8.6435 3.1165 4.8602 28.6738 19.4466 9.8558 30.9334 10.5336 133.0913 66.2317 8.0586 9.4920 215.4377 260.3073 17.4604 65.1435 52.3962 28.4021 13.4224 28.6537 5.8987 2.5167 9.9629 3.1544 33.7231 22.3438 37.9230 3.4004 20.1514 110.9047 134.6965 12.4695 55.4866 27.4586 17.6478 45.5277 235.2124 29.2831 19.5247 28.7989 16.6239 460.0332 172.1963 63.7075 198.7029 487.9267 36.5963 15.8859 49.5542 5.3700 32.8454 10.5630 2.5800 0.5568 3.5835 9.8451 36.1284 81.1863
temp: 298.150 k
press: 1.00000 atm
elementType: 16 16 16 8 8 8 8 7 7 7 7 7 7 7 7 6 6 6 6 6 6 6 6 6 6 6 6 6 1 1 1 1 1 1 1 1 1 1 1 1
symmnumber: 1
zpe: 690785.6 jmol-1
zpe.correction: 0.263106 hartree
zpe.thermalcorrener: 0.289549 hartree
zpe.thermalcorrenthalpy: 0.290493 hartree
zpe.thermalcorrgfe: 0.199303 hartree
zpe.sumelectzpe: -2433.526814 hartree
zpe.sumelectthermal: -2433.500372 hartree
zpe.sumelectthermalent: -2433.499427 hartree
zpe.sumelectthermalfe: -2433.590617 hartree
dipole: 8.2176 3.3158 -0.7675
dipole: 8.8945
quadrupole: -239.9029 -189.1389 -180.2581
quadrupole: -34.0018 14.7379 15.6223
quadrupole: -36.8029 13.9611 22.8418 -34.0018 14.7379 15.6223
hfenergy: -2433.7899201 hartree
pointgroup: C01 [X(C13H12N8O4S3)]
dipole: -3.0722046 -0.6612225 -1.5394755 debye
polarizability: 343.1850339|-46.5982739|211.8248721|-1.7097868|50.6879951|257.8736306 unknown
InChI: InChI=1S/C13H12N8O4S3/c22-7(1-20-4-14-18-19-20)16-8-10(23)21-9(12(24)25)6(2-26-11(8)21)3-27-13-17-15-5-28-13/h4-5,8,11,16,24H,1-3H2
charge 0 multiplicity 1
40 atoms
S  -0.410189 -0.237988 1.455191
S  -4.977754 0.207201 -0.928448
S  -6.395669 2.58656 0.548732
O  0.733315 -0.426042 -2.89658
O  -1.399911 -2.523765 -3.297393
O  -3.510243 -1.614584 -2.951958
O  4.369039 -0.931096 0.083772
N  -0.425783 -1.500066 -1.02019
N  2.29925 0.128517 -0.086336
N  5.392058 1.417038 1.389469
N  5.426427 2.278296 2.515428
N  -4.869142 0.786228 1.806916
N  7.275381 0.953796 2.482902
N  6.568008 1.982248 3.158219
N  -5.310724 1.673737 2.814867
C  0.311733 -1.520478 0.262857
C  1.597768 -1.060262 -0.517306
C  0.647454 -0.911215 -1.761869
C  -1.82849 -1.534671 -1.171299
C  -2.660826 -1.285502 -0.093981
C  -2.160877 -0.95247 1.30211
C  -4.161071 -1.387815 -0.193683
C  -2.353483 -1.86364 -2.528385
C  3.66284 0.113929 0.156636
C  4.270701 1.498424 0.4554
C  -5.327867 1.098204 0.590538
C  6.520274 0.635862 1.402244
C  -6.083652 2.641663 2.344112
H  0.34124 -2.503131 0.755663
H  2.341869 -1.866934 -0.628111
H  -2.199182 -1.856594 1.939172
H  -2.836371 -0.20622 1.760698
H  1.761816 0.99142 0.030647
H  -4.625696 -1.517101 0.795654
H  -4.504768 -2.157434 -0.897928
H  3.539149 2.191684 0.902426
H  4.609615 1.931065 -0.505655
H  -1.75013 -2.661772 -4.218319
H  6.73831 -0.138243 0.67501
H  -6.509319 3.42725 2.967079
