program: Orca
programVersion: 5.0.2
elementType: S S P O O O C C C C C C C C C C H H H H H H H H H H H H H H H
charge: 0
multiplicity: 1
keywords: wb97x-d3
keywords: def2-TZVPP
keywords: def2/J RIJCOSX
keywords: DEFGRID2
keywords: scfconv7
keywords: smallprint printgap noloewdin
keywords: NOSOSCF
formula: C10H15O3PS2
InChI: InChI=1/C10H15O3PS2/c1-8-7-9(5-6-10(8)16-4)13-14(15,11-2)12-3/h5-7H,1-4H3
31 atoms
S  -4.472553 -0.464818 0.433474
S  1.902987 -0.072674 -2.053995
P  2.417623 -0.073777 -0.223895
O  1.337441 0.55335 0.825008
O  2.763798 -1.512149 0.363662
O  3.704742 0.772169 0.205838
C  -2.154226 0.919607 -0.206469
C  -0.008748 0.301315 0.706055
C  -2.730026 -0.143345 0.501632
C  -0.783785 1.12032 -0.096816
C  -0.575099 -0.741515 1.416142
C  -1.939554 -0.951794 1.310023
C  -2.967875 1.823275 -1.082081
C  -4.575041 -1.371282 -1.133004
C  3.274893 -1.696816 1.680957
C  3.889128 2.101877 -0.262955
H  -0.310403 1.925307 -0.643838
H  0.034271 -1.374944 2.046995
H  -2.40355 -1.760908 1.858011
H  -3.887305 2.135339 -0.588655
H  -2.403256 2.712104 -1.359829
H  -3.256863 1.322518 -2.008268
H  -3.957501 -2.266508 -1.106152
H  -4.281184 -0.753617 -1.979254
H  -5.615053 -1.665569 -1.26523
H  2.691885 -1.154645 2.427365
H  4.31549 -1.380155 1.745111
H  3.212861 -2.761529 1.891991
H  3.167093 2.783119 0.19025
H  3.797792 2.151623 -1.348804
H  4.892099 2.403457 0.02868
totalener: -1753.69070780 hartree
nucrepener: 1545.20724860 hartree
electener: -3298.89795640 hartree
oneelecener: -5485.05134973 hartree
twoeener: 2186.15339332 hartree
kineticenergy: 1748.88186646 hartree
xcener: -114.455904296383 hartree
chargesum: 0.0000000
charge: -0.096753 -0.356248 0.709668 -0.358601 -0.311232 -0.318164 0.042340 0.274148 -0.053733 -0.136626 -0.157260 -0.097603 -0.222782 -0.275902 -0.140579 -0.125835 0.096626 0.110612 0.113174 0.107422 0.083078 0.095348 0.113512 0.103258 0.114675 0.104152 0.121131 0.122370 0.113814 0.109933 0.116055
qa: -0.0968 -0.3562 0.7097 -0.3586 -0.3112 -0.3182 0.0423 0.2741 -0.0537 -0.1366 -0.1573 -0.0976 -0.2228 -0.2759 -0.1406 -0.1258 0.0966 0.1106 0.1132 0.1074 0.0831 0.0953 0.1135 0.1033 0.1147 0.1042 0.1211 0.1224 0.1138 0.1099 0.1161
va: 2.2378 2.0946 5.5097 2.0566 2.1347 2.0941 3.6953 3.7928 3.8849 4.0482 4.0843 4.0182 3.9021 3.9865 3.8854 3.8754 1.0264 1.0039 1.0216 1.0084 1.0099 0.9936 0.9991 0.9978 1.0026 0.9905 0.9946 0.9875 0.9876 1.0043 0.9913
dispcorr: -0.014184381 hartree
energy: -1753.704892182870
dipole: -6.21917 6.78418 0.56501 2.43158 -2.15306 0.27852 0.28857 0.37120 0.65977
magnitude: 0.91220 au
magnitude: 2.31862 debye
