program: Orca
programVersion: 5.0.2
elementType: S S P O O O C C C C C C C C C C H H H H H H H H H H H H H H H
charge: 0
multiplicity: 1
keywords: wb97x-d3
keywords: def2-TZVPP
keywords: def2/J RIJCOSX
keywords: DEFGRID2
keywords: scfconv7
keywords: smallprint printgap noloewdin
keywords: NOSOSCF
formula: C10H15O3PS2
InChI: InChI=1/C10H15O3PS2/c1-8-7-9(5-6-10(8)16-4)13-14(15,11-2)12-3/h5-7H,1-4H3
31 atoms
S  -4.222465 1.14442 0.532915
S  2.557242 0.21388 -1.888442
P  2.426485 -0.41991 -0.086967
O  1.142517 -1.328729 0.280906
O  3.51946 -1.452311 0.428595
O  2.450797 0.71246 1.045209
C  -2.067051 0.048848 -0.836686
C  -0.104341 -0.747556 0.318505
C  -2.627916 0.38022 0.403652
C  -0.800255 -0.525765 -0.857713
C  -0.645246 -0.402993 1.545191
C  -1.912432 0.153304 1.57544
C  -2.785924 0.290661 -2.128953
C  -5.303863 -0.283781 0.260894
C  4.885561 -1.293675 0.066071
C  2.016636 2.049822 0.819827
H  -0.342617 -0.793772 -1.801273
H  -0.088432 -0.578416 2.455774
H  -2.359344 0.421853 2.523352
H  -2.090804 0.298906 -2.966835
H  -3.520624 -0.49244 -2.327503
H  -3.323172 1.23771 -2.114297
H  -6.328849 0.067557 0.36981
H  -5.118838 -1.059876 1.000412
H  -5.187715 -0.697766 -0.7386
H  5.330051 -0.434702 0.570981
H  4.998741 -1.172217 -1.011929
H  5.399016 -2.197044 0.384582
H  2.339677 2.414173 -0.155545
H  2.462046 2.660865 1.601258
H  0.930656 2.120575 0.88499
totalener: -1753.69155283 hartree
nucrepener: 1549.74550086 hartree
electener: -3303.43705370 hartree
oneelecener: -5494.02807008 hartree
twoeener: 2190.59101638 hartree
kineticenergy: 1748.89410752 hartree
xcener: -114.460281121234 hartree
chargesum: -0.0000000
charge: -0.091546 -0.403240 0.712918 -0.315270 -0.304901 -0.318704 0.035206 0.190279 -0.045912 -0.117598 -0.199336 -0.065098 -0.239442 -0.278013 -0.129428 -0.104702 0.119905 0.130317 0.117706 0.094099 0.094138 0.108571 0.115751 0.113688 0.103136 0.111194 0.112589 0.118126 0.111987 0.116775 0.106805
qa: -0.0915 -0.4032 0.7129 -0.3153 -0.3049 -0.3187 0.0352 0.1903 -0.0459 -0.1176 -0.1993 -0.0651 -0.2394 -0.2780 -0.1294 -0.1047 0.1199 0.1303 0.1177 0.0941 0.0941 0.1086 0.1158 0.1137 0.1031 0.1112 0.1126 0.1181 0.1120 0.1168 0.1068
va: 2.2437 2.0355 5.5328 2.1371 2.1478 2.0887 3.6667 3.8361 3.8709 3.9928 4.0121 3.9154 3.8978 3.9877 3.8715 3.8521 1.0197 1.0099 1.0185 1.0076 0.9921 1.0126 1.0031 0.9991 0.9970 0.9869 1.0041 0.9914 1.0121 0.9905 0.9823
dispcorr: -0.014260217 hartree
energy: -1753.705813048862
dipole: -9.26272 9.28355 0.02084 2.21292 -2.20831 0.00461 -0.84429 1.29258 0.44829
magnitude: 0.44880 au
magnitude: 1.14076 debye
