program: Orca
programVersion: 5.0.2
elementType: S S P O O O C C C C C C C C C C H H H H H H H H H H H H H H H
charge: 0
multiplicity: 1
keywords: wb97x-d3
keywords: def2-TZVPP
keywords: def2/J RIJCOSX
keywords: DEFGRID2
keywords: scfconv7
keywords: smallprint printgap noloewdin
keywords: NOSOSCF
formula: C10H15O3PS2
InChI: InChI=1/C10H15O3PS2/c1-8-7-9(5-6-10(8)16-4)13-14(15,11-2)12-3/h5-7H,1-4H3
31 atoms
S  -4.484628 0.827659 -0.402038
S  4.026122 -1.035681 -0.793414
P  2.479874 -0.348007 0.082058
O  1.119399 -1.059915 -0.403564
O  2.383658 -0.538196 1.665137
O  2.204217 1.224842 -0.045094
C  -1.989323 0.531356 0.773281
C  -0.156789 -0.558292 -0.355963
C  -2.792924 0.298535 -0.34928
C  -0.671513 0.085865 0.758439
C  -0.942272 -0.766524 -1.478321
C  -2.257774 -0.338619 -1.462967
C  -2.51613 1.232714 1.98891
C  -5.273632 -0.553358 0.468555
C  3.520112 -0.311298 2.491694
C  2.344432 1.89993 -1.289821
H  -0.055791 0.237812 1.634751
H  -0.528984 -1.268153 -2.343177
H  -2.885411 -0.500276 -2.329595
H  -1.709415 1.486816 2.675048
H  -3.043551 2.147789 1.72266
H  -3.224348 0.607366 2.5358
H  -5.090729 -1.494356 -0.045897
H  -6.344905 -0.359576 0.475315
H  -4.929715 -0.630273 1.498156
H  3.266732 -0.681608 3.48174
H  3.753393 0.75245 2.556034
H  4.391874 -0.847704 2.1158
H  1.505683 1.677797 -1.951441
H  3.276885 1.62555 -1.784887
H  2.349563 2.965194 -1.072591
totalener: -1753.69070816 hartree
nucrepener: 1537.56878637 hartree
electener: -3291.25949452 hartree
oneelecener: -5469.52019327 hartree
twoeener: 2178.26069875 hartree
kineticenergy: 1748.87702050 hartree
xcener: -114.457025535085 hartree
chargesum: -0.0000000
charge: -0.093924 -0.367263 0.676217 -0.296706 -0.310710 -0.307569 0.021859 0.148198 -0.058805 -0.076330 -0.177782 -0.071489 -0.220832 -0.276284 -0.126695 -0.111111 0.109519 0.131381 0.116592 0.082740 0.106996 0.092101 0.112462 0.115780 0.100910 0.115101 0.113969 0.115188 0.109299 0.111956 0.115230
qa: -0.0939 -0.3673 0.6762 -0.2967 -0.3107 -0.3076 0.0219 0.1482 -0.0588 -0.0763 -0.1778 -0.0715 -0.2208 -0.2763 -0.1267 -0.1111 0.1095 0.1314 0.1166 0.0827 0.1070 0.0921 0.1125 0.1158 0.1009 0.1151 0.1140 0.1152 0.1093 0.1120 0.1152
va: 2.2386 2.0989 5.5322 2.1550 2.1043 2.0724 3.7163 3.9434 3.8892 3.8535 3.9977 3.9461 3.9144 3.9888 3.8628 3.8651 1.0372 1.0107 1.0175 1.0095 1.0071 0.9944 0.9987 1.0030 0.9973 0.9907 0.9876 1.0069 0.9844 1.0097 0.9912
dispcorr: -0.013873775 hartree
energy: -1753.704581930039
dipole: -11.52956 11.07036 -0.45920 5.64811 -5.05918 0.58893 8.03763 -7.23306 0.80457
magnitude: 1.09774 au
magnitude: 2.79022 debye
