program: Orca
programVersion: 5.0.2
elementType: S S P O O O C C C C C C C C C C H H H H H H H H H H H H H H H
charge: 0
multiplicity: 1
keywords: wb97x-d3
keywords: def2-TZVPP
keywords: def2/J RIJCOSX
keywords: DEFGRID2
keywords: scfconv7
keywords: smallprint printgap noloewdin
keywords: NOSOSCF
formula: C10H15O3PS2
InChI: InChI=1/C10H15O3PS2/c1-8-7-9(5-6-10(8)16-4)13-14(15,11-2)12-3/h5-7H,1-4H3
31 atoms
S  -4.526539 -0.277768 -0.212636
S  2.341333 -1.638409 -1.077095
P  2.403889 -0.151692 0.123551
O  1.208476 -0.018206 1.199283
O  3.668572 -0.066023 1.09133
O  2.380461 1.310097 -0.513706
C  -2.154865 1.081512 0.271972
C  -0.113981 -0.081596 0.819293
C  -2.794261 -0.158884 0.152292
C  -0.803518 1.098348 0.598685
C  -0.741256 -1.308618 0.708133
C  -2.085068 -1.333576 0.376119
C  -2.881219 2.373229 0.048579
C  -4.508602 -0.066761 -2.013497
C  4.218554 -1.229742 1.695399
C  3.13611 1.608279 -1.681401
H  -0.282081 2.041716 0.700546
H  -0.190591 -2.22369 0.875104
H  -2.597574 -2.281844 0.285609
H  -3.842862 2.382419 0.559295
H  -2.293987 3.21949 0.401549
H  -3.08248 2.53795 -1.011458
H  -4.150173 0.91886 -2.303529
H  -5.536433 -0.1749 -2.35658
H  -3.897836 -0.830603 -2.489504
H  5.155221 -0.929695 2.15842
H  4.410948 -2.006623 0.954523
H  3.553586 -1.625149 2.464243
H  2.846116 2.607726 -1.995573
H  2.922562 0.899167 -2.48189
H  4.206184 1.598993 -1.46978
totalener: -1753.69327610 hartree
nucrepener: 1538.76940522 hartree
electener: -3292.46268132 hartree
oneelecener: -5472.25397207 hartree
twoeener: 2179.79129075 hartree
kineticenergy: 1748.89222299 hartree
xcener: -114.458277337676 hartree
chargesum: 0.0000000
charge: -0.095396 -0.397563 0.723457 -0.336515 -0.312167 -0.316157 0.051878 0.246030 -0.062639 -0.153420 -0.162793 -0.074799 -0.224299 -0.276827 -0.122716 -0.124413 0.109607 0.119785 0.114938 0.107767 0.084018 0.091664 0.100161 0.115228 0.114486 0.116511 0.110159 0.114451 0.112907 0.112999 0.113656
qa: -0.0954 -0.3976 0.7235 -0.3365 -0.3122 -0.3162 0.0519 0.2460 -0.0626 -0.1534 -0.1628 -0.0748 -0.2243 -0.2768 -0.1227 -0.1244 0.1096 0.1198 0.1149 0.1078 0.0840 0.0917 0.1002 0.1152 0.1145 0.1165 0.1102 0.1145 0.1129 0.1130 0.1137
va: 2.2381 2.0424 5.5275 2.1277 2.1165 2.1309 3.6521 3.8301 3.8936 4.0559 4.0579 3.9724 3.9037 3.9868 3.8668 3.8765 1.0233 1.0164 1.0194 1.0094 1.0092 0.9934 0.9973 1.0027 0.9989 0.9908 1.0051 0.9873 0.9914 1.0025 0.9878
dispcorr: -0.013427973 hartree
energy: -1753.706704073310
dipole: -5.19403 5.83513 0.64110 6.74555 -6.11184 0.63371 -5.25478 4.97924 -0.27554
magnitude: 0.94262 au
magnitude: 2.39594 debye
