program: Orca
programVersion: 5.0.2
elementType: S S P O O O C C C C C C C C C C H H H H H H H H H H H H H H H
charge: 0
multiplicity: 1
keywords: wb97x-d3
keywords: def2-TZVPP
keywords: def2/J RIJCOSX
keywords: DEFGRID2
keywords: scfconv7
keywords: smallprint printgap noloewdin
keywords: NOSOSCF
formula: C10H15O3PS2
InChI: InChI=1/C10H15O3PS2/c1-8-7-9(5-6-10(8)16-4)13-14(15,11-2)12-3/h5-7H,1-4H3
31 atoms
S  -4.359233 -0.442588 0.415709
S  2.636176 -1.397352 -1.347274
P  2.464881 0.215608 -0.332472
O  1.220055 1.1836 -0.670524
O  2.396123 0.019245 1.257672
O  3.590706 1.326292 -0.50387
C  -1.987078 0.691983 1.028536
C  -0.06837 0.754675 -0.433219
C  -2.694637 -0.007502 0.037573
C  -0.67543 1.064569 0.774051
C  -0.756462 0.055066 -1.404698
C  -2.069979 -0.318305 -1.164846
C  -2.634355 1.038898 2.33528
C  -4.963582 -1.152627 -1.122051
C  1.971968 -1.194953 1.867051
C  4.956153 0.953941 -0.631557
H  -0.120483 1.618829 1.520921
H  -0.276229 -0.193943 -2.340898
H  -2.595017 -0.861718 -1.937127
H  -1.943803 1.569937 2.988135
H  -3.510546 1.674054 2.188746
H  -2.973479 0.146688 2.866131
H  -6.009866 -1.396027 -0.947743
H  -4.44063 -2.069666 -1.38733
H  -4.908769 -0.441289 -1.944228
H  0.887824 -1.300873 1.815828
H  2.277788 -1.143272 2.909379
H  2.434581 -2.060851 1.393273
H  5.356138 0.589184 0.315726
H  5.497634 1.849972 -0.923334
H  5.088747 0.185754 -1.394377
totalener: -1753.69376382 hartree
nucrepener: 1545.40688647 hartree
electener: -3299.10065029 hartree
oneelecener: -5485.38539885 hartree
twoeener: 2186.28474856 hartree
kineticenergy: 1748.88333104 hartree
xcener: -114.463924083633 hartree
chargesum: -0.0000000
charge: -0.040985 -0.405528 0.714210 -0.317887 -0.325182 -0.304066 0.065450 0.207040 -0.008721 -0.196566 -0.165091 -0.135367 -0.232144 -0.288767 -0.106948 -0.128890 0.116595 0.125918 0.113476 0.079580 0.105462 0.100925 0.122366 0.112578 0.116924 0.108252 0.115965 0.112291 0.109595 0.117540 0.111978
qa: -0.0410 -0.4055 0.7142 -0.3179 -0.3252 -0.3041 0.0655 0.2070 -0.0087 -0.1966 -0.1651 -0.1354 -0.2321 -0.2888 -0.1069 -0.1289 0.1166 0.1259 0.1135 0.0796 0.1055 0.1009 0.1224 0.1126 0.1169 0.1083 0.1160 0.1123 0.1096 0.1175 0.1120
va: 2.3896 2.0350 5.5358 2.1407 2.0800 2.1437 3.6453 3.8451 3.9836 3.9563 4.1159 3.8967 3.9053 4.0073 3.8533 3.8722 1.0178 1.0146 1.0069 1.0093 1.0015 0.9987 1.0051 0.9929 0.9953 0.9825 0.9902 1.0126 0.9870 0.9912 1.0048
dispcorr: -0.013603065 hartree
energy: -1753.707366886110
dipole: -8.09223 7.86810 -0.22413 -2.24548 2.09447 -0.15101 5.99350 -5.48647 0.50704
magnitude: 0.57457 au
magnitude: 1.46043 debye
