program: Orca
programVersion: 5.0.2
elementType: S P O O O N C C C C C C C C C C C C C H H H H H H H H H H H H H H H H H H H H H H
charge: 0
multiplicity: 1
keywords: wb97x-d3
keywords: def2-TZVPP
keywords: def2/J RIJCOSX
keywords: DEFGRID2
keywords: scfconv7
keywords: smallprint printgap noloewdin
keywords: NOSOSCF
formula: C13H22NO3PS
InChI: InChI=1/C13H22NO3PS/c1-6-16-18(15,14-10(2)3)17-12-7-8-13(19-5)11(4)9-12/h7-10,14H,6H2,1-5H3
41 atoms
S  -4.80733 -0.555271 0.195844
P  2.007106 0.419952 0.181546
O  0.821512 0.9953 -0.767851
O  3.255127 1.158696 -0.489009
O  1.824016 0.685972 1.630474
N  2.08843 -1.17016 -0.203058
C  2.734927 -2.163459 0.663184
C  4.253341 -2.096516 0.587676
C  2.216435 -3.540967 0.288393
C  -0.489908 0.640907 -0.500926
C  -2.409274 -0.714891 -1.046103
C  -1.085232 -0.35504 -1.25805
C  3.713399 2.448225 -0.031227
C  -1.20079 1.296091 0.486059
C  -3.134092 -0.056015 -0.038323
C  -2.524233 0.945098 0.711035
C  -3.037939 -1.791641 -1.875749
C  2.807371 3.580104 -0.450226
C  -5.353525 0.45031 1.584453
H  2.421589 -1.945982 1.685652
H  2.139669 -1.39038 -1.191527
H  4.600649 -2.273485 -0.432108
H  4.628883 -1.124402 0.909626
H  4.704074 -2.852843 1.231445
H  1.131233 -3.594323 0.375039
H  2.644754 -4.298816 0.944145
H  2.490185 -3.797014 -0.737666
H  -0.513061 -0.857127 -2.028999
H  3.837826 2.427692 1.052574
H  4.700984 2.565607 -0.473972
H  -0.74306 2.084351 1.069018
H  -3.066722 1.469159 1.485114
H  -3.907919 -1.422392 -2.42322
H  -2.331863 -2.185212 -2.604908
H  -3.37919 -2.627013 -1.260287
H  2.652336 3.591385 -1.528713
H  1.836615 3.540048 0.043818
H  3.276674 4.523843 -0.171105
H  -5.342866 1.513533 1.351199
H  -4.765004 0.260409 2.480546
H  -6.382466 0.154537 1.782639
elementType: S P O N C H
totalener: -1528.84505973 hartree
nucrepener: 1822.32711447 hartree
electener: -3351.17217421 hartree
oneelecener: -5721.45940842 hartree
twoeener: 2370.28723422 hartree
cpcmener: -0.03751230 hartree
kineticenergy: 1523.71695120 hartree
xcener: -113.006094547685 hartree
chargesum: -0.0000000
charge: -0.075787 0.907503 -0.387233 -0.382401 -0.673739 -0.274435 0.104132 -0.270500 -0.268888 0.295222 0.041854 -0.227686 0.045030 -0.236654 -0.039140 -0.157740 -0.227142 -0.247128 -0.273516 0.065962 0.160156 0.087654 0.087086 0.091447 0.092163 0.090157 0.090071 0.135836 0.092238 0.108207 0.152603 0.147627 0.102048 0.095622 0.101558 0.088155 0.082754 0.099233 0.121652 0.121924 0.134090
qa: -0.0758 0.9075 -0.3872 -0.3824 -0.6737 -0.2744 0.1041 -0.2705 -0.2689 0.2952 0.0419 -0.2277 0.0450 -0.2367 -0.0391 -0.1577 -0.2271 -0.2471 -0.2735 0.0660 0.1602 0.0877 0.0871 0.0914 0.0922 0.0902 0.0901 0.1358 0.0922 0.1082 0.1526 0.1476 0.1020 0.0956 0.1016 0.0882 0.0828 0.0992 0.1217 0.1219 0.1341
va: 2.3846 5.5254 2.0690 2.0653 1.9076 3.1544 3.8732 3.9204 3.9257 3.6727 3.6636 4.0499 3.8426 4.0610 3.9458 3.8594 3.8889 3.9141 3.9883 1.0234 1.0225 1.0052 1.0133 1.0083 1.0099 1.0052 1.0025 1.0113 1.0077 0.9907 1.0048 0.9980 0.9990 1.0076 1.0014 1.0068 1.0089 1.0089 0.9947 0.9959 0.9992
dispcorr: -0.018645778 hartree
energy: -1528.863705510246
dipole: 8.40308 -8.10453 0.29855 -6.28418 5.93605 -0.34813 0.90501 -1.73070 -0.82569
magnitude: 0.94450 au
magnitude: 2.40074 debye
