program: Orca
programVersion: 5.0.2
elementType: S P O O O N C C C C C C C C C C C C C H H H H H H H H H H H H H H H H H H H H H H
charge: 0
multiplicity: 1
keywords: wb97x-d3
keywords: def2-TZVPP
keywords: def2/J RIJCOSX
keywords: DEFGRID2
keywords: scfconv7
keywords: smallprint printgap noloewdin
keywords: NOSOSCF
formula: C13H22NO3PS
InChI: InChI=1/C13H22NO3PS/c1-6-16-18(15,14-10(2)3)17-12-7-8-13(19-5)11(4)9-12/h7-10,14H,6H2,1-5H3
41 atoms
S  -4.881285 0.942831 0.387902
P  2.030573 -0.36724 0.142544
O  0.690007 -0.758174 -0.694832
O  1.934376 1.220437 0.05998
O  2.084626 -0.958024 1.502665
N  3.275132 -0.810239 -0.822349
C  3.903546 -2.134721 -0.754582
C  5.303072 -2.03944 -1.337297
C  3.078764 -3.20431 -1.455518
C  -0.587424 -0.328474 -0.410097
C  -2.306951 0.474771 1.084897
C  -0.996064 0.075342 0.854275
C  2.493935 2.087008 1.069279
C  -1.490863 -0.336799 -1.458334
C  -3.226936 0.450589 0.025497
C  -2.80519 0.044742 -1.236497
C  -2.72047 0.916682 2.454762
C  1.466524 3.123052 1.445768
C  -5.739819 0.700073 -1.17535
H  3.990264 -2.393245 0.301844
H  3.308269 -0.384014 -1.741737
H  5.271367 -1.750186 -2.390167
H  5.908274 -1.308113 -0.801664
H  5.8061 -3.0042 -1.273985
H  2.09432 -3.31697 -0.999545
H  3.578611 -4.172107 -1.400482
H  2.938456 -2.958605 -2.510128
H  -0.310974 0.072664 1.692362
H  2.796753 1.509834 1.944111
H  3.38761 2.550442 0.650465
H  -1.176765 -0.645633 -2.447116
H  -3.490191 0.021892 -2.072431
H  -1.884169 0.875434 3.150559
H  -3.095008 1.942893 2.448893
H  -3.518476 0.28868 2.857247
H  0.572625 2.662481 1.868033
H  1.886715 3.790351 2.198356
H  1.173953 3.728731 0.58803
H  -6.778515 0.971029 -0.993001
H  -5.709486 -0.338874 -1.499428
H  -5.351833 1.345313 -1.961605
elementType: S P O N C H
totalener: -1528.84417281 hartree
nucrepener: 1811.88654348 hartree
electener: -3340.73071629 hartree
oneelecener: -5700.43744413 hartree
twoeener: 2359.70672785 hartree
cpcmener: -0.03536327 hartree
kineticenergy: 1523.69717990 hartree
xcener: -113.005359124211 hartree
chargesum: 0.0000000
charge: -0.076927 0.899642 -0.355605 -0.369800 -0.669118 -0.277060 0.106117 -0.267059 -0.269068 0.285618 0.055514 -0.209871 0.054555 -0.262269 -0.062106 -0.142788 -0.241623 -0.249813 -0.273987 0.066374 0.158681 0.090160 0.092836 0.088207 0.086513 0.091062 0.087378 0.123525 0.090408 0.103267 0.147849 0.147957 0.095895 0.102686 0.104980 0.081990 0.097873 0.091503 0.133479 0.122057 0.120968
qa: -0.0769 0.8996 -0.3556 -0.3698 -0.6691 -0.2771 0.1061 -0.2671 -0.2691 0.2856 0.0555 -0.2099 0.0546 -0.2623 -0.0621 -0.1428 -0.2416 -0.2498 -0.2740 0.0664 0.1587 0.0902 0.0928 0.0882 0.0865 0.0911 0.0874 0.1235 0.0904 0.1033 0.1478 0.1480 0.0959 0.1027 0.1050 0.0820 0.0979 0.0915 0.1335 0.1221 0.1210
va: 2.3830 5.5120 2.1082 2.0732 1.9079 3.1417 3.8792 3.9219 3.9156 3.7336 3.6797 3.8590 3.8429 4.0707 3.9680 3.8543 3.8969 3.9417 3.9882 1.0229 1.0242 1.0026 1.0108 1.0049 1.0158 1.0082 1.0058 1.0399 1.0067 0.9951 1.0065 0.9953 1.0078 0.9987 1.0018 1.0016 1.0088 1.0039 0.9992 0.9954 0.9946
dispcorr: -0.018495397 hartree
energy: -1528.862668203033
dipole: 9.39921 -9.01705 0.38215 0.00427 0.83015 0.83442 -2.76989 0.96658 -1.80331
magnitude: 2.02342 au
magnitude: 5.14311 debye
