program: Orca
programVersion: 5.0.2
elementType: S P O O O N C C C C C C C C C C C C C H H H H H H H H H H H H H H H H H H H H H H
charge: 0
multiplicity: 1
keywords: wb97x-d3
keywords: def2-TZVPP
keywords: def2/J RIJCOSX
keywords: DEFGRID2
keywords: scfconv7
keywords: smallprint printgap noloewdin
keywords: NOSOSCF
formula: C13H22NO3PS
InChI: InChI=1/C13H22NO3PS/c1-6-16-18(15,14-10(2)3)17-12-7-8-13(19-5)11(4)9-12/h7-10,14H,6H2,1-5H3
41 atoms
S  -4.696639 0.559013 -0.827226
P  1.996346 -0.370873 0.806793
O  0.583219 -0.756865 1.497708
O  1.80423 1.06911 0.151558
O  3.046494 -0.446709 1.855713
N  2.052776 -1.333976 -0.526783
C  3.061944 -1.16254 -1.581627
C  2.631078 -1.97658 -2.789973
C  4.464511 -1.542274 -1.127817
C  -0.636585 -0.470038 0.910738
C  -2.504419 1.039993 0.681783
C  -1.257169 0.733326 1.207694
C  2.369781 2.263509 0.728552
C  -1.246754 -1.391908 0.083669
C  -3.125579 0.108588 -0.168536
C  -2.493206 -1.098062 -0.451795
C  -3.163888 2.341254 1.021172
C  3.742964 2.534914 0.166981
C  -5.139387 -0.844975 -1.863401
H  3.058741 -0.107125 -1.861919
H  1.835872 -2.3074 -0.339935
H  3.336528 -1.842642 -3.609642
H  2.599221 -3.042084 -2.550977
H  1.643842 -1.677139 -3.141448
H  5.173278 -1.439787 -1.950355
H  4.495183 -2.578123 -0.784134
H  4.813214 -0.905399 -0.314376
H  -0.768754 1.441791 1.866679
H  1.678191 3.063756 0.469263
H  2.394893 2.191433 1.816745
H  -0.769358 -2.336791 -0.140471
H  -2.956217 -1.830336 -1.097936
H  -2.536069 2.936784 1.681577
H  -3.364981 2.937679 0.128545
H  -4.120991 2.187505 1.524762
H  4.110009 3.485528 0.555035
H  4.456246 1.760862 0.45103
H  3.71995 2.60601 -0.920679
H  -5.246416 -1.761533 -1.286483
H  -4.426784 -0.995494 -2.672071
H  -6.106616 -0.600415 -2.299643
elementType: S P O N C H
totalener: -1528.84324880 hartree
nucrepener: 1830.47727914 hartree
electener: -3359.32052794 hartree
oneelecener: -5737.12928962 hartree
twoeener: 2377.80876168 hartree
cpcmener: -0.04115664 hartree
kineticenergy: 1523.70178899 hartree
xcener: -113.003778601002 hartree
chargesum: -0.0000000
charge: -0.074954 0.859264 -0.391266 -0.367729 -0.668905 -0.249015 0.091160 -0.268827 -0.267690 0.265422 0.026748 -0.186142 0.055105 -0.242388 -0.031981 -0.157070 -0.228144 -0.253726 -0.274351 0.073317 0.158209 0.090046 0.091000 0.092676 0.091604 0.090536 0.081660 0.141074 0.106637 0.095326 0.151158 0.148535 0.095656 0.100310 0.101978 0.103803 0.082888 0.089819 0.121494 0.122299 0.134465
qa: -0.0750 0.8593 -0.3913 -0.3677 -0.6689 -0.2490 0.0912 -0.2688 -0.2677 0.2654 0.0267 -0.1861 0.0551 -0.2424 -0.0320 -0.1571 -0.2281 -0.2537 -0.2744 0.0733 0.1582 0.0900 0.0910 0.0927 0.0916 0.0905 0.0817 0.1411 0.1066 0.0953 0.1512 0.1485 0.0957 0.1003 0.1020 0.1038 0.0829 0.0898 0.1215 0.1223 0.1345
va: 2.3848 5.5378 2.0930 2.0490 1.9074 3.0853 3.8816 3.9265 3.9162 3.7162 3.6651 3.9809 3.8182 4.0832 3.9439 3.8527 3.8892 3.9327 3.9876 1.0144 1.0208 1.0050 1.0028 1.0098 1.0083 1.0065 1.0166 1.0043 0.9933 1.0048 1.0021 0.9969 1.0074 1.0009 0.9997 1.0103 1.0102 1.0027 0.9950 0.9952 0.9992
dispcorr: -0.019374409 hartree
energy: -1528.862623210882
dipole: 10.62687 -11.40592 -0.77904 1.86113 -1.92789 -0.06676 -13.86116 11.58286 -2.27830
magnitude: 2.40874 au
magnitude: 6.12252 debye
