program: Orca
programVersion: 5.0.2
elementType: S P O O O N C C C C C C C C C C C C C H H H H H H H H H H H H H H H H H H H H H H
charge: 0
multiplicity: 1
keywords: wb97x-d3
keywords: def2-TZVPP
keywords: def2/J RIJCOSX
keywords: DEFGRID2
keywords: scfconv7
keywords: smallprint printgap noloewdin
keywords: NOSOSCF
formula: C13H22NO3PS
InChI: InChI=1/C13H22NO3PS/c1-6-16-18(15,14-10(2)3)17-12-7-8-13(19-5)11(4)9-12/h7-10,14H,6H2,1-5H3
41 atoms
S  -4.862632 -0.773441 -0.236049
P  1.910442 0.344417 0.762673
O  0.628532 1.30099 0.506027
O  3.044122 1.430161 1.026264
O  1.821286 -0.54676 1.946546
N  2.156002 -0.372163 -0.688803
C  3.091967 -1.484821 -0.866026
C  3.809032 -1.330444 -2.19676
C  2.39044 -2.829883 -0.752367
C  -0.641842 0.784291 0.314836
C  -2.640974 -0.225245 1.205899
C  -1.348469 0.250553 1.381368
C  3.531136 2.336207 0.01908
C  -1.208082 0.856538 -0.942893
C  -3.221808 -0.154165 -0.072014
C  -2.500849 0.388916 -1.130786
C  -3.393895 -0.797792 2.366826
C  5.007561 2.115695 -0.187684
C  -5.256687 -0.466633 -1.965239
H  3.836963 -1.413217 -0.069277
H  1.473571 -0.251969 -1.426174
H  4.524914 -2.139395 -2.343432
H  3.099907 -1.358394 -3.027138
H  4.351605 -0.38568 -2.246172
H  1.917705 -2.944842 0.22327
H  3.099736 -3.648364 -0.880631
H  1.618365 -2.931272 -1.517924
H  -0.902202 0.219379 2.367466
H  2.989182 2.206392 -0.919312
H  3.33168 3.345903 0.378525
H  -0.655284 1.279832 -1.771982
H  -2.929031 0.455237 -2.12084
H  -3.690681 -1.832867 2.183033
H  -2.787518 -0.783895 3.270763
H  -4.307932 -0.235572 2.571052
H  5.388675 2.854302 -0.893097
H  5.562053 2.228407 0.744169
H  5.210561 1.125002 -0.595832
H  -6.274031 -0.827338 -2.109213
H  -4.601225 -1.015748 -2.638997
H  -5.232747 0.594781 -2.206679
elementType: S P O N C H
totalener: -1528.84375083 hartree
nucrepener: 1815.49970191 hartree
electener: -3344.34345274 hartree
oneelecener: -5707.03215463 hartree
twoeener: 2362.68870189 hartree
cpcmener: -0.04398159 hartree
kineticenergy: 1523.70242781 hartree
xcener: -113.007004368191 hartree
chargesum: -0.0000000
charge: -0.073408 0.839240 -0.367707 -0.367669 -0.670526 -0.249366 0.092807 -0.267025 -0.266870 0.226488 0.016668 -0.161586 0.046815 -0.229365 -0.034700 -0.149782 -0.228480 -0.253976 -0.274711 0.071636 0.177044 0.092106 0.093471 0.091523 0.084118 0.091106 0.086848 0.133870 0.089906 0.106801 0.155598 0.149019 0.101916 0.096131 0.101573 0.094213 0.092719 0.084712 0.134394 0.121874 0.122574
qa: -0.0734 0.8392 -0.3677 -0.3677 -0.6705 -0.2494 0.0928 -0.2670 -0.2669 0.2265 0.0167 -0.1616 0.0468 -0.2294 -0.0347 -0.1498 -0.2285 -0.2540 -0.2747 0.0716 0.1770 0.0921 0.0935 0.0915 0.0841 0.0911 0.0868 0.1339 0.0899 0.1068 0.1556 0.1490 0.1019 0.0961 0.1016 0.0942 0.0927 0.0847 0.1344 0.1219 0.1226
va: 2.3859 5.5392 2.0604 2.0734 1.9159 3.0208 3.8581 3.9336 3.9470 3.7500 3.7044 3.9836 3.8508 4.0441 3.9462 3.8508 3.8911 3.9447 3.9869 1.0115 1.0125 1.0059 1.0029 1.0051 1.0198 1.0072 1.0048 1.0232 1.0066 0.9963 0.9987 0.9962 0.9997 1.0078 1.0006 1.0078 1.0041 1.0032 0.9992 0.9949 0.9952
dispcorr: -0.019053954 hartree
energy: -1528.862804783839
dipole: 12.10734 -12.12305 -0.01570 -5.59949 6.21212 0.61263 -13.82684 10.23824 -3.58860
magnitude: 3.64055 au
magnitude: 9.25354 debye
