program: Orca
programVersion: 5.0.2
elementType: S P O O O N C C C C C C C C C C C C C H H H H H H H H H H H H H H H H H H H H H H
charge: 0
multiplicity: 1
keywords: wb97x-d3
keywords: def2-TZVPP
keywords: def2/J RIJCOSX
keywords: DEFGRID2
keywords: scfconv7
keywords: smallprint printgap noloewdin
keywords: NOSOSCF
formula: C13H22NO3PS
InChI: InChI=1/C13H22NO3PS/c1-6-16-18(15,14-10(2)3)17-12-7-8-13(19-5)11(4)9-12/h7-10,14H,6H2,1-5H3
41 atoms
S  -4.819911 0.879666 0.398147
P  1.980945 -0.180856 0.010031
O  0.717102 -0.85832 -0.766135
O  2.201981 1.172722 -0.803574
O  1.721572 -0.035713 1.464995
N  3.268194 -1.103762 -0.409551
C  3.376885 -2.518143 -0.008427
C  3.954645 -2.651377 1.391205
C  4.237165 -3.240608 -1.029241
C  -0.567838 -0.448799 -0.453632
C  -2.486226 0.920287 -0.97239
C  -1.183697 0.51542 -1.235968
C  2.373527 2.443736 -0.138108
C  -1.234471 -1.019756 0.613359
C  -3.168159 0.337712 0.108968
C  -2.535424 -0.625966 0.888184
C  -3.14084 1.95802 -1.831316
C  1.048222 3.116138 0.117998
C  -5.341548 -0.105893 1.81077
H  2.384719 -2.980645 -0.019064
H  3.681217 -0.887097 -1.307727
H  4.963963 -2.239447 1.438024
H  3.342395 -2.139181 2.132583
H  4.004585 -3.702833 1.677315
H  4.310691 -4.298279 -0.778863
H  5.248753 -2.829929 -1.047943
H  3.817097 -3.163081 -2.032954
H  -0.648845 0.954471 -2.069613
H  2.93491 2.31346 0.788326
H  2.987471 3.039038 -0.811999
H  -0.756949 -1.776179 1.222165
H  -3.041654 -1.08432 1.725771
H  -3.458218 2.824775 -1.247189
H  -2.461039 2.312357 -2.604333
H  -4.031123 1.564738 -2.327434
H  0.427463 2.539935 0.804647
H  1.224861 4.093534 0.568306
H  0.493484 3.271277 -0.807514
H  -5.320551 -1.172535 1.593855
H  -6.372202 0.181124 2.012896
H  -4.747687 0.104473 2.698621
elementType: S P O N C H
totalener: -1528.84340680 hartree
nucrepener: 1826.75254514 hartree
electener: -3355.59595194 hartree
oneelecener: -5730.44884884 hartree
twoeener: 2374.85289690 hartree
cpcmener: -0.03630415 hartree
kineticenergy: 1523.70292902 hartree
xcener: -113.003252096252 hartree
chargesum: -0.0000000
charge: -0.075808 0.900049 -0.384594 -0.384493 -0.671783 -0.284639 0.095089 -0.264150 -0.266198 0.309090 0.061292 -0.254882 0.053324 -0.246048 -0.036220 -0.153475 -0.232148 -0.255592 -0.273625 0.065297 0.165256 0.081479 0.082788 0.093154 0.090255 0.094362 0.098161 0.137027 0.093862 0.105538 0.152106 0.147337 0.100967 0.096188 0.104731 0.082508 0.109074 0.087069 0.121516 0.133993 0.122144
qa: -0.0758 0.9000 -0.3846 -0.3845 -0.6718 -0.2846 0.0951 -0.2642 -0.2662 0.3091 0.0613 -0.2549 0.0533 -0.2460 -0.0362 -0.1535 -0.2321 -0.2556 -0.2736 0.0653 0.1653 0.0815 0.0828 0.0932 0.0903 0.0944 0.0982 0.1370 0.0939 0.1055 0.1521 0.1473 0.1010 0.0962 0.1047 0.0825 0.1091 0.0871 0.1215 0.1340 0.1221
va: 2.3846 5.5399 2.0452 2.0735 1.9000 3.1257 3.9042 3.8992 3.9071 3.6357 3.6226 4.0033 3.8486 4.0752 3.9477 3.8456 3.8885 3.9062 3.9879 1.0141 1.0231 1.0101 1.0261 1.0072 1.0065 1.0039 1.0059 1.0144 1.0052 0.9930 1.0035 0.9975 1.0004 1.0072 1.0002 1.0139 1.0093 1.0022 0.9954 0.9993 0.9951
dispcorr: -0.019153703 hartree
energy: -1528.862560498003
dipole: 8.19746 -7.80750 0.38996 -2.27145 2.09444 -0.17701 1.58760 -2.50552 -0.91792
magnitude: 1.01291 au
magnitude: 2.57461 debye
