program: Orca
programVersion: 5.0.2
elementType: S P O O O N C C C C C C C C C C C C C H H H H H H H H H H H H H H H H H H H H H H
charge: 0
multiplicity: 1
keywords: wb97x-d3
keywords: def2-TZVPP
keywords: def2/J RIJCOSX
keywords: DEFGRID2
keywords: scfconv7
keywords: smallprint printgap noloewdin
keywords: NOSOSCF
formula: C13H22NO3PS
InChI: InChI=1/C13H22NO3PS/c1-6-16-18(15,14-10(2)3)17-12-7-8-13(19-5)11(4)9-12/h7-10,14H,6H2,1-5H3
41 atoms
S  -4.621053 0.994376 -0.497209
P  2.029261 -0.39338 0.613979
O  0.812345 -1.286465 0.00897
O  1.940483 0.911784 -0.310962
O  1.950434 -0.120917 2.071052
N  3.30685 -1.301978 0.158427
C  3.67712 -1.569585 -1.235765
C  4.121131 -3.015942 -1.375489
C  4.749656 -0.605696 -1.718548
C  -0.455472 -0.752785 -0.094176
C  -2.527575 -0.098104 0.953317
C  -1.243434 -0.628096 1.038507
C  1.822438 2.252273 0.207662
C  -0.920414 -0.368095 -1.338729
C  -2.994754 0.314005 -0.301948
C  -2.197291 0.161415 -1.43144
C  -3.359649 0.026432 2.191706
C  0.380742 2.667067 0.365087
C  -4.304545 2.71693 -0.032967
H  2.78287 -1.429049 -1.846451
H  4.082246 -1.311279 0.809571
H  3.331117 -3.703003 -1.072642
H  4.382015 -3.236858 -2.410819
H  5.001035 -3.216076 -0.760592
H  4.994828 -0.796699 -2.763771
H  5.665756 -0.720825 -1.135326
H  4.422681 0.430587 -1.635337
H  -0.863541 -0.956076 1.998153
H  2.360446 2.340485 1.152334
H  2.329165 2.885932 -0.518752
H  -0.299867 -0.477318 -2.21832
H  -2.575261 0.471861 -2.396511
H  -2.858653 -0.430527 3.043596
H  -3.549796 1.07098 2.44329
H  -4.330923 -0.452608 2.07082
H  0.345448 3.710025 0.682367
H  -0.165493 2.585625 -0.574752
H  -0.133241 2.073079 1.121143
H  -3.570992 3.17044 -0.696757
H  -3.965122 2.798675 0.99809
H  -5.244978 3.257875 -0.130667
elementType: S P O N C H
totalener: -1528.84139760 hartree
nucrepener: 1854.80189347 hartree
electener: -3383.64329107 hartree
oneelecener: -5785.81960671 hartree
twoeener: 2402.17631564 hartree
cpcmener: -0.03409442 hartree
kineticenergy: 1523.72443390 hartree
xcener: -113.004485421389 hartree
chargesum: 0.0000000
charge: -0.144780 0.841653 -0.368945 -0.362248 -0.666235 -0.269840 0.119691 -0.267638 -0.275191 0.278702 0.011445 -0.178303 0.058637 -0.224217 -0.007363 -0.118208 -0.218805 -0.263537 -0.271004 0.067995 0.162488 0.090258 0.089116 0.089839 0.091029 0.089604 0.087696 0.130774 0.091909 0.103186 0.151603 0.131199 0.096858 0.105313 0.101564 0.109517 0.087663 0.088101 0.115573 0.116135 0.128767
qa: -0.1448 0.8417 -0.3689 -0.3622 -0.6662 -0.2698 0.1197 -0.2676 -0.2752 0.2787 0.0114 -0.1783 0.0586 -0.2242 -0.0074 -0.1182 -0.2188 -0.2635 -0.2710 0.0680 0.1625 0.0903 0.0891 0.0898 0.0910 0.0896 0.0877 0.1308 0.0919 0.1032 0.1516 0.1312 0.0969 0.1053 0.1016 0.1095 0.0877 0.0881 0.1156 0.1161 0.1288
va: 2.2111 5.5472 2.0714 2.0220 1.9261 3.1057 3.8530 3.9337 3.9462 3.6661 3.6837 3.9629 3.8350 4.0017 3.7369 3.9365 3.8917 3.9254 3.9653 1.0161 1.0209 1.0112 1.0052 1.0040 1.0064 1.0031 1.0121 1.0240 1.0080 0.9920 0.9983 1.0152 1.0080 0.9931 1.0060 1.0115 1.0039 1.0045 0.9993 0.9957 0.9990
dispcorr: -0.021401382 hartree
energy: -1528.862798984668
dipole: 9.18208 -8.08683 1.09525 6.90593 -5.70068 1.20525 -3.87793 2.66351 -1.21443
magnitude: 2.03151 au
magnitude: 5.16369 debye
