program: Orca
programVersion: 5.0.2
elementType: S P O O O N C C C C C C C C C C C C C H H H H H H H H H H H H H H H H H H H H H H
charge: 0
multiplicity: 1
keywords: wb97x-d3
keywords: def2-TZVPP
keywords: def2/J RIJCOSX
keywords: DEFGRID2
keywords: scfconv7
keywords: smallprint printgap noloewdin
keywords: NOSOSCF
formula: C13H22NO3PS
InChI: InChI=1/C13H22NO3PS/c1-6-16-18(15,14-10(2)3)17-12-7-8-13(19-5)11(4)9-12/h7-10,14H,6H2,1-5H3
41 atoms
S  -4.85664 -0.622933 -0.482461
P  1.911415 0.753174 0.705336
O  0.671573 1.449916 -0.090109
O  3.029121 1.501788 -0.148226
O  1.907202 1.002907 2.168709
N  1.969818 -0.832598 0.331244
C  2.069115 -1.404043 -1.013547
C  0.832991 -2.226789 -1.342873
C  3.34039 -2.230463 -1.1349
C  -0.599154 0.933438 -0.125335
C  -2.441781 -0.29072 0.848772
C  -1.146729 0.215138 0.928177
C  4.418956 1.346166 0.211079
C  -1.336502 1.176686 -1.273009
C  -3.183412 -0.058597 -0.31666
C  -2.625902 0.680692 -1.355937
C  -2.993349 -1.06717 2.004145
C  4.907422 2.537786 0.994098
C  -4.600796 -2.370833 -0.887907
H  2.129777 -0.574607 -1.721174
H  1.763754 -1.487053 1.074498
H  0.71445 -3.050582 -0.635888
H  -0.072523 -1.62065 -1.314302
H  0.917859 -2.656621 -2.34132
H  4.224726 -1.623855 -0.937852
H  3.435181 -2.648286 -2.13767
H  3.333801 -3.061128 -0.426247
H  -0.585446 0.053466 1.840084
H  4.572936 0.421643 0.771997
H  4.958771 1.247729 -0.729531
H  -0.907792 1.740532 -2.091191
H  -3.207269 0.865886 -2.249546
H  -3.05682 -2.131577 1.771699
H  -2.358432 -0.963807 2.882249
H  -3.998594 -0.738863 2.265677
H  4.388823 2.632374 1.947736
H  5.970751 2.418598 1.201545
H  4.779202 3.46295 0.432656
H  -5.584697 -2.80821 -1.051996
H  -4.116964 -2.909481 -0.075773
H  -4.016488 -2.478438 -1.799171
elementType: S P O N C H
totalener: -1528.84228627 hartree
nucrepener: 1843.11382149 hartree
electener: -3371.95610776 hartree
oneelecener: -5761.90017640 hartree
twoeener: 2389.94406864 hartree
cpcmener: -0.03771925 hartree
kineticenergy: 1523.71603314 hartree
xcener: -113.006158612330 hartree
chargesum: -0.0000000
charge: -0.143370 0.809361 -0.342088 -0.364682 -0.660620 -0.240316 0.129083 -0.268892 -0.275571 0.260285 0.020767 -0.179935 0.044934 -0.218038 -0.040350 -0.099236 -0.230145 -0.246773 -0.269851 0.073746 0.170498 0.094015 0.076351 0.095476 0.093167 0.092047 0.089639 0.123183 0.089609 0.108913 0.147541 0.131017 0.109381 0.098566 0.099945 0.078207 0.096136 0.088541 0.126102 0.116579 0.116781
qa: -0.1434 0.8094 -0.3421 -0.3647 -0.6606 -0.2403 0.1291 -0.2689 -0.2756 0.2603 0.0208 -0.1799 0.0449 -0.2180 -0.0404 -0.0992 -0.2301 -0.2468 -0.2699 0.0737 0.1705 0.0940 0.0764 0.0955 0.0932 0.0920 0.0896 0.1232 0.0896 0.1089 0.1475 0.1310 0.1094 0.0986 0.0999 0.0782 0.0961 0.0885 0.1261 0.1166 0.1168
va: 2.2199 5.5524 2.1024 2.0682 1.9182 3.0471 3.7978 3.9367 3.9512 3.7252 3.7145 3.8351 3.8454 3.9979 3.7585 3.9615 3.8855 3.9576 3.9637 1.0195 1.0179 1.0043 1.0108 1.0087 1.0036 1.0061 1.0034 1.0422 1.0011 0.9905 1.0043 1.0148 0.9908 1.0085 1.0107 1.0172 1.0069 1.0041 0.9987 0.9964 0.9998
dispcorr: -0.020956789 hartree
energy: -1528.863243058605
dipole: 11.39021 -10.20792 1.18229 -15.90488 13.37771 -2.52717 -4.28772 2.74546 -1.54226
magnitude: 3.18794 au
magnitude: 8.10310 debye
