program: Orca
programVersion: 5.0.2
elementType: S P O O O N C C C C C C C C C C C C C H H H H H H H H H H H H H H H H H H H H H H
charge: 0
multiplicity: 1
keywords: wb97x-d3
keywords: def2-TZVPP
keywords: def2/J RIJCOSX
keywords: DEFGRID2
keywords: scfconv7
keywords: smallprint printgap noloewdin
keywords: NOSOSCF
formula: C13H22NO3PS
InChI: InChI=1/C13H22NO3PS/c1-6-16-18(15,14-10(2)3)17-12-7-8-13(19-5)11(4)9-12/h7-10,14H,6H2,1-5H3
41 atoms
S  -4.603279 1.394213 0.029495
P  2.119494 0.00091 0.633744
O  0.792929 -0.944805 0.701654
O  1.973677 0.586037 -0.84534
O  2.198947 1.011831 1.716355
N  3.369274 -1.048214 0.605875
C  3.541054 -2.145671 -0.349489
C  3.024819 -3.462745 0.210715
C  5.007192 -2.247514 -0.737471
C  -0.458872 -0.385467 0.545687
C  -2.382832 -0.016436 -0.866211
C  -1.10774 -0.538096 -0.668399
C  2.147185 1.989624 -1.127826
C  -1.05362 0.29529 1.594212
C  -2.995803 0.660922 0.198087
C  -2.326492 0.811181 1.408569
C  -3.052316 -0.192482 -2.193397
C  0.841538 2.734905 -1.000706
C  -5.668199 -0.067917 0.151695
H  2.967617 -1.894834 -1.244053
H  3.826064 -1.1899 1.499088
H  3.150423 -4.264126 -0.518129
H  3.575149 -3.742131 1.11177
H  1.966607 -3.40628 0.464112
H  5.368595 -1.315673 -1.172274
H  5.155265 -3.041551 -1.469612
H  5.624416 -2.478829 0.133521
H  -0.613398 -1.06841 -1.473486
H  2.910689 2.419362 -0.47718
H  2.523524 2.035806 -2.148656
H  -0.547098 0.405901 2.543645
H  -2.807866 1.337221 2.222287
H  -3.539746 0.725388 -2.52072
H  -2.334192 -0.492232 -2.955086
H  -3.822751 -0.965146 -2.151684
H  0.080118 2.320926 -1.662327
H  0.461762 2.714805 0.021535
H  0.9948 3.778102 -1.278897
H  -5.496572 -0.763836 -0.666789
H  -6.69845 0.281402 0.095427
H  -5.524546 -0.576319 1.102888
elementType: S P O N C H
totalener: -1528.84198094 hartree
nucrepener: 1841.10395801 hartree
electener: -3369.94593894 hartree
oneelecener: -5758.66747800 hartree
twoeener: 2388.72153906 hartree
cpcmener: -0.03354314 hartree
kineticenergy: 1523.71679389 hartree
xcener: -113.002368048274 hartree
chargesum: -0.0000000
charge: -0.139988 0.847507 -0.368395 -0.366980 -0.665275 -0.269960 0.113502 -0.278479 -0.263497 0.312865 0.049085 -0.230288 0.054522 -0.247323 -0.024042 -0.097537 -0.232862 -0.254484 -0.270532 0.070537 0.163285 0.091860 0.088372 0.089476 0.090660 0.088310 0.088952 0.133401 0.094280 0.104744 0.146193 0.131229 0.100841 0.100833 0.112276 0.086937 0.081076 0.107974 0.117606 0.125639 0.117677
qa: -0.1400 0.8475 -0.3684 -0.3670 -0.6653 -0.2700 0.1135 -0.2785 -0.2635 0.3129 0.0491 -0.2303 0.0545 -0.2473 -0.0240 -0.0975 -0.2329 -0.2545 -0.2705 0.0705 0.1633 0.0919 0.0884 0.0895 0.0907 0.0883 0.0890 0.1334 0.0943 0.1047 0.1462 0.1312 0.1008 0.1008 0.1123 0.0869 0.0811 0.1080 0.1176 0.1256 0.1177
va: 2.2209 5.5534 2.0415 2.0472 1.9283 3.1182 3.8557 3.9399 3.9335 3.6277 3.6105 4.0003 3.8403 4.0613 3.7586 3.9651 3.8769 3.9143 3.9660 1.0189 1.0211 1.0064 1.0039 1.0156 1.0114 1.0049 1.0038 1.0141 1.0064 0.9934 1.0125 1.0161 1.0129 1.0054 0.9902 1.0028 1.0120 1.0121 0.9962 0.9987 0.9992
dispcorr: -0.020486420 hartree
energy: -1528.862467357085
dipole: 5.22768 -4.97450 0.25318 -8.67861 7.06210 -1.61651 -11.05540 9.46969 -1.58571
magnitude: 2.27852 au
magnitude: 5.79155 debye
