program: Orca
programVersion: 5.0.2
elementType: S P O O O N C C C C C C C C C C C C C H H H H H H H H H H H H H H H H H H H H H H
charge: 0
multiplicity: 1
keywords: wb97x-d3
keywords: def2-TZVPP
keywords: def2/J RIJCOSX
keywords: DEFGRID2
keywords: scfconv7
keywords: smallprint printgap noloewdin
keywords: NOSOSCF
formula: C13H22NO3PS
InChI: InChI=1/C13H22NO3PS/c1-6-16-18(15,14-10(2)3)17-12-7-8-13(19-5)11(4)9-12/h7-10,14H,6H2,1-5H3
41 atoms
S  -4.50093 -0.901669 -0.407128
P  2.158037 0.394174 0.901753
O  0.826734 1.334421 0.883002
O  3.269117 1.536788 0.942875
O  2.265472 -0.478344 2.096724
N  2.18036 -0.398147 -0.525645
C  2.334915 -1.845316 -0.694601
C  3.426681 -2.13585 -1.711865
C  1.010858 -2.483394 -1.0871
C  -0.406195 0.792357 0.570687
C  -2.248988 -0.68095 1.078745
C  -0.997881 -0.160976 1.386257
C  3.816254 2.186336 -0.219309
C  -1.052272 1.24218 -0.565128
C  -2.912068 -0.21785 -0.069955
C  -2.30691 0.740067 -0.877906
C  -2.867888 -1.71903 1.96392
C  2.845694 3.112649 -0.912553
C  -5.072234 0.046317 -1.82731
H  2.645881 -2.249979 0.268825
H  1.898317 0.103664 -1.359443
H  3.572944 -3.211012 -1.818669
H  3.165172 -1.736544 -2.694101
H  4.375754 -1.69448 -1.407616
H  0.243692 -2.298449 -0.333807
H  1.120716 -3.563077 -1.195508
H  0.65326 -2.087026 -2.039975
H  -0.492631 -0.503608 2.280646
H  4.671133 2.747006 0.154778
H  4.194624 1.43165 -0.911759
H  -0.587956 1.983166 -1.203535
H  -2.79777 1.107765 -1.767876
H  -2.216098 -1.957039 2.802721
H  -3.8248 -1.383593 2.370306
H  -3.059641 -2.647366 1.421038
H  3.382812 3.652778 -1.692228
H  2.025878 2.578828 -1.394101
H  2.428505 3.848028 -0.224708
H  -4.456724 -0.119253 -2.710244
H  -5.12861 1.111313 -1.607208
H  -6.078054 -0.311885 -2.041544
elementType: S P O N C H
totalener: -1528.84264055 hartree
nucrepener: 1853.21442756 hartree
electener: -3382.05706811 hartree
oneelecener: -5782.28541076 hartree
twoeener: 2400.22834265 hartree
cpcmener: -0.04470498 hartree
kineticenergy: 1523.69249954 hartree
xcener: -113.007193174787 hartree
chargesum: -0.0000000
charge: -0.075146 0.850689 -0.369188 -0.374068 -0.671506 -0.242719 0.126112 -0.273119 -0.279676 0.217650 0.024747 -0.164987 0.037214 -0.231204 -0.028106 -0.158378 -0.229898 -0.243859 -0.274144 0.061331 0.170772 0.092130 0.089964 0.089970 0.087562 0.096754 0.090350 0.129974 0.107796 0.089070 0.157785 0.148085 0.096324 0.104522 0.101822 0.102909 0.073105 0.091277 0.121035 0.122976 0.134074
qa: -0.0751 0.8507 -0.3692 -0.3741 -0.6715 -0.2427 0.1261 -0.2731 -0.2797 0.2177 0.0247 -0.1650 0.0372 -0.2312 -0.0281 -0.1584 -0.2299 -0.2439 -0.2741 0.0613 0.1708 0.0921 0.0900 0.0900 0.0876 0.0968 0.0904 0.1300 0.1078 0.0891 0.1578 0.1481 0.0963 0.1045 0.1018 0.1029 0.0731 0.0913 0.1210 0.1230 0.1341
va: 2.3836 5.5074 2.0472 2.0759 1.9225 3.0508 3.8348 3.9242 3.9263 3.7758 3.6732 3.9079 3.8907 4.0121 3.9372 3.8689 3.8893 3.9141 3.9872 1.0288 1.0107 1.0061 1.0031 1.0096 1.0085 1.0108 1.0046 1.0314 0.9886 0.9997 0.9927 0.9975 1.0078 1.0020 0.9984 1.0102 1.0028 1.0064 0.9944 0.9962 0.9991
dispcorr: -0.020754408 hartree
energy: -1528.863394957677
dipole: 3.20570 -3.66751 -0.46181 -4.99293 5.68818 0.69525 -16.17463 12.40930 -3.76533
magnitude: 3.85673 au
magnitude: 9.80302 debye
