program: Orca
programVersion: 5.0.2
elementType: S P O O O N C C C C C C C C C C C C C H H H H H H H H H H H H H H H H H H H H H H
charge: 0
multiplicity: 1
keywords: wb97x-d3
keywords: def2-TZVPP
keywords: def2/J RIJCOSX
keywords: DEFGRID2
keywords: scfconv7
keywords: smallprint printgap noloewdin
keywords: NOSOSCF
formula: C13H22NO3PS
InChI: InChI=1/C13H22NO3PS/c1-6-16-18(15,14-10(2)3)17-12-7-8-13(19-5)11(4)9-12/h7-10,14H,6H2,1-5H3
41 atoms
S  -4.947627 0.334925 0.238046
P  2.017294 -0.265568 0.521335
O  0.905861 0.156124 -0.599083
O  3.091982 0.889994 0.293258
O  1.434885 -0.418708 1.87768
N  2.823896 -1.586085 0.000394
C  3.374976 -1.771384 -1.346026
C  2.44708 -2.613263 -2.20837
C  4.758809 -2.392945 -1.249355
C  -0.451974 0.156706 -0.37226
C  -2.393249 1.090542 0.718093
C  -1.018681 1.0439 0.53166
C  2.760554 2.289525 0.391403
C  -1.251479 -0.698158 -1.106736
C  -3.208966 0.225668 -0.031403
C  -2.628721 -0.655736 -0.938069
C  -2.981661 2.052483 1.703983
C  2.823459 2.784152 1.81587
C  -5.624282 -0.901898 -0.880224
H  3.475386 -0.784232 -1.801031
H  2.576761 -2.446455 0.474317
H  2.304084 -3.603824 -1.770946
H  1.467225 -2.147203 -2.316901
H  2.865716 -2.748003 -3.206282
H  4.712167 -3.37361 -0.770911
H  5.436574 -1.764562 -0.671795
H  5.188514 -2.52853 -2.242244
H  -0.388778 1.724974 1.091859
H  3.495903 2.801562 -0.227416
H  1.778426 2.482051 -0.044783
H  -0.811795 -1.388435 -1.815771
H  -3.236743 -1.327065 -1.528067
H  -2.202543 2.632878 2.19505
H  -3.666015 2.755505 1.223726
H  -3.549116 1.535285 2.481026
H  3.801958 2.59869 2.259039
H  2.652547 3.860838 1.82469
H  2.062726 2.322956 2.445198
H  -5.409114 -0.6732 -1.92265
H  -6.703767 -0.873209 -0.740075
H  -5.275412 -1.905016 -0.640654
elementType: S P O N C H
totalener: -1528.84440923 hartree
nucrepener: 1817.47397963 hartree
electener: -3346.31838887 hartree
oneelecener: -5711.40529645 hartree
twoeener: 2365.08690758 hartree
cpcmener: -0.03914015 hartree
kineticenergy: 1523.69523413 hartree
xcener: -113.005172401153 hartree
chargesum: -0.0000000
charge: -0.075953 0.842385 -0.386485 -0.355526 -0.666200 -0.266484 0.122336 -0.274759 -0.269261 0.241469 -0.018071 -0.116298 0.033749 -0.232334 -0.005659 -0.179748 -0.238731 -0.251858 -0.274974 0.068657 0.162909 0.090389 0.083870 0.092158 0.088875 0.090030 0.089160 0.138878 0.113276 0.099533 0.164157 0.144929 0.094982 0.101643 0.101985 0.093804 0.096457 0.078756 0.121993 0.134090 0.121872
qa: -0.0760 0.8424 -0.3865 -0.3555 -0.6662 -0.2665 0.1223 -0.2748 -0.2693 0.2415 -0.0181 -0.1163 0.0337 -0.2323 -0.0057 -0.1797 -0.2387 -0.2519 -0.2750 0.0687 0.1629 0.0904 0.0839 0.0922 0.0889 0.0900 0.0892 0.1389 0.1133 0.0995 0.1642 0.1449 0.0950 0.1016 0.1020 0.0938 0.0965 0.0788 0.1220 0.1341 0.1219
va: 2.3828 5.5559 2.0153 2.0837 1.9184 3.1201 3.8401 3.9522 3.9346 3.7784 3.7479 3.8969 3.8565 4.0449 3.9094 3.9129 3.8922 3.9227 3.9874 1.0203 1.0222 1.0030 1.0108 1.0077 1.0039 1.0113 1.0053 0.9881 0.9912 1.0004 0.9867 1.0010 1.0085 0.9996 0.9998 1.0052 1.0081 1.0168 0.9949 0.9991 0.9950
dispcorr: -0.019021958 hartree
energy: -1528.863431191795
dipole: 8.34279 -8.22895 0.11385 -2.10448 1.84420 -0.26028 -6.28966 4.20160 -2.08805
magnitude: 2.10729 au
magnitude: 5.35630 debye
