program: Orca
programVersion: 5.0.2
elementType: S P O O O N C C C C C C C C C C C C C H H H H H H H H H H H H H H H H H H H H H H
charge: 0
multiplicity: 1
keywords: wb97x-d3
keywords: def2-TZVPP
keywords: def2/J RIJCOSX
keywords: DEFGRID2
keywords: scfconv7
keywords: smallprint printgap noloewdin
keywords: NOSOSCF
formula: C13H22NO3PS
InChI: InChI=1/C13H22NO3PS/c1-6-16-18(15,14-10(2)3)17-12-7-8-13(19-5)11(4)9-12/h7-10,14H,6H2,1-5H3
41 atoms
S  -4.543497 -0.890537 -0.411821
P  2.16533 0.361262 0.792747
O  0.837462 1.298368 0.719626
O  3.284797 1.495546 0.804826
O  2.282696 -0.473337 2.01317
N  2.192008 -0.481817 -0.608083
C  2.424988 -1.926794 -0.698521
C  3.179474 -2.233452 -1.980987
C  1.120814 -2.704023 -0.611475
C  -0.403498 0.758455 0.43931
C  -2.273627 -0.6418 1.041146
C  -1.008539 -0.135069 1.310482
C  3.636298 2.293801 -0.341765
C  -1.045979 1.156966 -0.71724
C  -2.935261 -0.228403 -0.127324
C  -2.313932 0.666428 -0.993379
C  -2.911035 -1.608977 1.99057
C  2.944651 3.634994 -0.33268
C  -5.091981 -0.033592 -1.896446
H  3.058313 -2.207757 0.144073
H  1.786913 -0.060182 -1.435125
H  3.388898 -3.300874 -2.051441
H  2.59401 -1.951368 -2.858932
H  4.129476 -1.700375 -2.019663
H  0.61126 -2.515859 0.334456
H  1.304499 -3.776988 -0.682893
H  0.44519 -2.423278 -1.422194
H  -0.503786 -0.4380 2.219473
H  4.716752 2.421073 -0.286181
H  3.422737 1.750465 -1.264624
H  -0.570292 1.852107 -1.397386
H  -2.803358 0.995336 -1.899176
H  -3.846132 -1.217038 2.397048
H  -3.148374 -2.556465 1.501681
H  -2.250862 -1.826695 2.828261
H  3.336234 4.236317 -1.153688
H  1.868145 3.547258 -0.472902
H  3.134089 4.176268 0.594191
H  -4.478349 -0.274171 -2.76279
H  -5.126151 1.045122 -1.752876
H  -6.104815 -0.384687 -2.08798
elementType: S P O N C H
totalener: -1528.84338637 hartree
nucrepener: 1845.14640213 hartree
electener: -3373.98978850 hartree
oneelecener: -5766.19506009 hartree
twoeener: 2392.20527159 hartree
cpcmener: -0.04382980 hartree
kineticenergy: 1523.69956158 hartree
xcener: -113.007653627513 hartree
chargesum: 0.0000000
charge: -0.074276 0.859796 -0.366672 -0.378162 -0.672206 -0.251353 0.126195 -0.267254 -0.284888 0.229526 0.052066 -0.196053 0.056666 -0.236052 -0.043022 -0.147114 -0.229713 -0.248226 -0.273972 0.058944 0.170076 0.088962 0.090341 0.092311 0.087556 0.099201 0.087449 0.133425 0.104113 0.086145 0.152840 0.150221 0.103652 0.101307 0.096731 0.096464 0.078672 0.088190 0.121758 0.122582 0.133776
qa: -0.0743 0.8598 -0.3667 -0.3782 -0.6722 -0.2514 0.1262 -0.2673 -0.2849 0.2295 0.0521 -0.1961 0.0567 -0.2361 -0.0430 -0.1471 -0.2297 -0.2482 -0.2740 0.0589 0.1701 0.0890 0.0903 0.0923 0.0876 0.0992 0.0874 0.1334 0.1041 0.0861 0.1528 0.1502 0.1037 0.1013 0.0967 0.0965 0.0787 0.0882 0.1218 0.1226 0.1338
va: 2.3855 5.5283 2.0547 2.0817 1.9200 3.0592 3.8399 3.9243 3.9220 3.7507 3.6548 3.9182 3.8596 4.0155 3.9488 3.8402 3.8908 3.9427 3.9873 1.0230 1.0133 1.0054 1.0027 1.0101 1.0116 1.0113 1.0052 1.0289 0.9924 1.0074 0.9978 0.9957 1.0017 0.9992 1.0074 1.0081 1.0096 1.0051 0.9943 0.9960 0.9991
dispcorr: -0.020189837 hartree
energy: -1528.863576206334
dipole: 2.73943 -3.39725 -0.65782 -4.35177 5.02175 0.66998 -14.03979 10.34523 -3.69456
magnitude: 3.81200 au
magnitude: 9.68935 debye
