program: Orca
programVersion: 5.0.2
elementType: S P O O O N C C C C C C C C C C C C C H H H H H H H H H H H H H H H H H H H H H H
charge: 0
multiplicity: 1
keywords: wb97x-d3
keywords: def2-TZVPP
keywords: def2/J RIJCOSX
keywords: DEFGRID2
keywords: scfconv7
keywords: smallprint printgap noloewdin
keywords: NOSOSCF
formula: C13H22NO3PS
InChI: InChI=1/C13H22NO3PS/c1-6-16-18(15,14-10(2)3)17-12-7-8-13(19-5)11(4)9-12/h7-10,14H,6H2,1-5H3
41 atoms
S  -5.03103 -0.490916 0.221293
P  1.999516 0.338416 0.152679
O  0.660685 0.968768 -0.510947
O  3.068701 1.357138 -0.447944
O  1.966838 0.248228 1.633218
N  2.214394 -1.09418 -0.61053
C  3.036273 -2.165062 -0.031141
C  4.525702 -1.881821 -0.161131
C  2.654787 -3.480906 -0.686861
C  -0.630391 0.546725 -0.277075
C  -2.972561 1.07749 -0.579216
C  -1.631034 1.394453 -0.733444
C  3.301274 2.647572 0.156964
C  -0.963579 -0.63931 0.35469
C  -3.313321 -0.128773 0.056381
C  -2.30463 -0.967476 0.513056
C  -4.029194 2.010789 -1.085057
C  4.687208 2.683533 0.747812
C  -5.048076 -2.086786 1.052829
H  2.779043 -2.225769 1.027668
H  2.225487 -1.069206 -1.6245
H  4.812234 -1.780432 -1.209754
H  4.806827 -0.963488 0.357229
H  5.111427 -2.694935 0.269549
H  3.221569 -4.300804 -0.245931
H  2.871638 -3.465231 -1.757233
H  1.594181 -3.697288 -0.556974
H  -1.358765 2.321406 -1.22414
H  3.188133 3.387504 -0.634922
H  2.550254 2.864953 0.918692
H  -0.217084 -1.331325 0.718414
H  -2.538352 -1.900928 1.005818
H  -3.586669 2.894175 -1.541766
H  -4.663037 1.532232 -1.835048
H  -4.686581 2.347567 -0.280405
H  5.446565 2.479231 -0.007059
H  4.882172 3.673808 1.159752
H  4.792202 1.957037 1.55411
H  -4.595047 -2.037687 2.04168
H  -4.564955 -2.862238 0.460927
H  -6.097762 -2.35176 1.171228
elementType: S P O N C H
totalener: -1528.84387149 hartree
nucrepener: 1797.38080301 hartree
electener: -3326.22467450 hartree
oneelecener: -5671.31530621 hartree
twoeener: 2345.09063171 hartree
cpcmener: -0.03616837 hartree
kineticenergy: 1523.70089380 hartree
xcener: -113.005236020676 hartree
chargesum: -0.0000000
charge: -0.078946 0.904485 -0.343015 -0.379198 -0.667592 -0.274270 0.113371 -0.269892 -0.271525 0.270070 0.028365 -0.195520 0.051865 -0.216781 -0.038235 -0.188878 -0.227600 -0.253822 -0.275578 0.067741 0.155789 0.087866 0.084793 0.091523 0.090173 0.090388 0.093557 0.132593 0.101504 0.088890 0.131383 0.147331 0.095175 0.101908 0.101276 0.090217 0.097953 0.084659 0.121964 0.122411 0.133599
qa: -0.0789 0.9045 -0.3430 -0.3792 -0.6676 -0.2743 0.1134 -0.2699 -0.2715 0.2701 0.0284 -0.1955 0.0519 -0.2168 -0.0382 -0.1889 -0.2276 -0.2538 -0.2756 0.0677 0.1558 0.0879 0.0848 0.0915 0.0902 0.0904 0.0936 0.1326 0.1015 0.0889 0.1314 0.1473 0.0952 0.1019 0.1013 0.0902 0.0980 0.0847 0.1220 0.1224 0.1336
va: 2.3801 5.5075 2.1434 2.0790 1.8996 3.0820 3.8430 3.9377 3.9319 3.7673 3.7056 3.9626 3.8526 3.9870 3.9368 3.9445 3.8878 3.9353 3.9903 1.0239 1.0265 1.0057 1.0105 1.0087 1.0049 1.0023 1.0071 1.0147 0.9958 1.0053 1.0269 0.9997 1.0078 1.0000 1.0000 1.0024 1.0089 1.0096 0.9949 0.9948 0.9993
dispcorr: -0.018125655 hartree
energy: -1528.861997147022
dipole: 13.01073 -12.51502 0.49571 -7.12617 6.39024 -0.73594 -0.72933 -0.50051 -1.22984
magnitude: 1.51652 au
magnitude: 3.85469 debye
