program: Orca
programVersion: 5.0.2
elementType: S P O O O N C C C C C C C C C C C C C H H H H H H H H H H H H H H H H H H H H H H
charge: 0
multiplicity: 1
keywords: wb97x-d3
keywords: def2-TZVPP
keywords: def2/J RIJCOSX
keywords: DEFGRID2
keywords: scfconv7
keywords: smallprint printgap noloewdin
keywords: NOSOSCF
formula: C13H22NO3PS
InChI: InChI=1/C13H22NO3PS/c1-6-16-18(15,14-10(2)3)17-12-7-8-13(19-5)11(4)9-12/h7-10,14H,6H2,1-5H3
41 atoms
S  -4.921274 -0.291416 0.27673
P  1.939357 0.430064 0.444182
O  0.846167 0.530932 -0.759676
O  3.179409 1.105345 -0.296625
O  1.468525 1.048059 1.708846
N  2.335273 -1.143728 0.604982
C  2.95106 -1.984057 -0.423553
C  2.272999 -3.343987 -0.450257
C  4.449887 -2.115771 -0.197613
C  -0.496061 0.357948 -0.482894
C  -2.425245 -1.089542 -0.397433
C  -1.070322 -0.894214 -0.632776
C  3.152242 2.443848 -0.834059
C  -1.262272 1.440019 -0.092994
C  -3.208006 0.009363 -0.005201
C  -2.618194 1.262058 0.138772
C  -3.028318 -2.450705 -0.561357
C  3.380985 3.489641 0.229546
C  -5.554299 1.318582 0.771984
H  2.782052 -1.499463 -1.387582
H  2.430532 -1.480363 1.554607
H  2.719228 -3.978777 -1.216181
H  2.382961 -3.853465 0.509548
H  1.208309 -3.253876 -0.665986
H  4.942082 -1.143249 -0.203252
H  4.905516 -2.726615 -0.977788
H  4.655455 -2.593909 0.762542
H  -0.459222 -1.732279 -0.946014
H  3.950757 2.466663 -1.574204
H  2.212796 2.620629 -1.360431
H  -0.817717 2.420684 0.01673
H  -3.203224 2.120905 0.435926
H  -3.477068 -2.806813 0.368724
H  -3.816908 -2.454067 -1.317286
H  -2.276586 -3.177197 -0.865198
H  2.561004 3.533613 0.945197
H  4.309901 3.311319 0.771284
H  3.45675 4.466894 -0.248166
H  -5.450281 2.060406 -0.018023
H  -5.083351 1.679585 1.684766
H  -6.615851 1.175808 0.968548
elementType: S P O N C H
totalener: -1528.84578172 hartree
nucrepener: 1821.71137454 hartree
electener: -3350.55715626 hartree
oneelecener: -5720.08800826 hartree
twoeener: 2369.53085201 hartree
cpcmener: -0.03835419 hartree
kineticenergy: 1523.70678511 hartree
xcener: -113.007025346380 hartree
chargesum: -0.0000000
charge: -0.074894 0.829533 -0.387226 -0.351763 -0.666944 -0.255701 0.103607 -0.267234 -0.277047 0.255550 -0.004896 -0.166706 0.046354 -0.233042 -0.013875 -0.167293 -0.241896 -0.250785 -0.273843 0.072971 0.163383 0.091181 0.092334 0.089814 0.089445 0.091378 0.088505 0.172634 0.105937 0.097499 0.151617 0.148489 0.102341 0.101935 0.096002 0.080219 0.088495 0.096430 0.121683 0.121730 0.134078
qa: -0.0749 0.8295 -0.3872 -0.3518 -0.6669 -0.2557 0.1036 -0.2672 -0.2770 0.2556 -0.0049 -0.1667 0.0464 -0.2330 -0.0139 -0.1673 -0.2419 -0.2508 -0.2738 0.0730 0.1634 0.0912 0.0923 0.0898 0.0894 0.0914 0.0885 0.1726 0.1059 0.0975 0.1516 0.1485 0.1023 0.1019 0.0960 0.0802 0.0885 0.0964 0.1217 0.1217 0.1341
va: 2.3846 5.5734 2.0276 2.0787 1.9234 3.1153 3.8408 3.9363 3.9442 3.7251 3.7125 3.9907 3.8496 4.0770 3.9297 3.8607 3.8982 3.9196 3.9881 1.0186 1.0210 1.0058 1.0034 1.0080 1.0138 1.0062 1.0039 0.9787 0.9905 1.0045 0.9980 0.9966 0.9999 0.9993 1.0067 1.0179 1.0048 1.0083 0.9950 0.9954 0.9992
dispcorr: -0.019031043 hartree
energy: -1528.864812761466
dipole: 9.58995 -9.19119 0.39876 -5.36374 5.01779 -0.34595 -3.20970 1.98152 -1.22818
magnitude: 1.33683 au
magnitude: 3.39796 debye
