program: Orca
programVersion: 5.0.2
elementType: S P O O O N C C C C C C C C C C C C C H H H H H H H H H H H H H H H H H H H H H H
charge: 0
multiplicity: 1
keywords: wb97x-d3
keywords: def2-TZVPP
keywords: def2/J RIJCOSX
keywords: DEFGRID2
keywords: scfconv7
keywords: smallprint printgap noloewdin
keywords: NOSOSCF
formula: C13H22NO3PS
InChI: InChI=1/C13H22NO3PS/c1-6-16-18(15,14-10(2)3)17-12-7-8-13(19-5)11(4)9-12/h7-10,14H,6H2,1-5H3
41 atoms
S  -4.63723 0.429283 -0.820862
P  2.137984 -0.108988 0.836552
O  0.718887 -0.530105 1.498948
O  1.871156 1.447162 0.606448
O  3.213325 -0.483171 1.784958
N  2.336504 -0.743133 -0.662927
C  3.04879 -2.001548 -0.914246
C  3.431533 -2.051437 -2.383531
C  2.242564 -3.224972 -0.505469
C  -0.502636 -0.303734 0.892608
C  -2.450475 1.094185 0.627558
C  -1.187415 0.872296 1.157804
C  2.864002 2.26397 -0.051064
C  -1.059684 -1.275073 0.083692
C  -3.025333 0.103798 -0.188188
C  -2.322708 -1.067156 -0.453082
C  -3.179156 2.366284 0.933256
C  2.707154 3.685083 0.423379
C  -5.053407 -1.084943 -1.69989
H  3.965568 -1.972714 -0.323084
H  1.626968 -0.517976 -1.352148
H  3.998421 -2.95764 -2.596212
H  2.543865 -2.058666 -3.0202
H  4.045697 -1.19599 -2.66517
H  1.986536 -3.199894 0.55466
H  2.814442 -4.136704 -0.683598
H  1.316579 -3.29282 -1.079483
H  -0.744692 1.621444 1.802729
H  3.867299 1.896944 0.175976
H  2.714993 2.192281 -1.129326
H  -0.529746 -2.196611 -0.118607
H  -2.744408 -1.840864 -1.07888
H  -2.583759 3.012239 1.576188
H  -3.410544 2.927164 0.025027
H  -4.127195 2.175356 1.44111
H  3.434623 4.314465 -0.089365
H  1.713761 4.075504 0.201252
H  2.88628 3.77106 1.495013
H  -4.389872 -1.266706 -2.543391
H  -6.062362 -0.941788 -2.08334
H  -5.058543 -1.949927 -1.038564
elementType: S P O N C H
totalener: -1528.84554971 hartree
nucrepener: 1826.70924124 hartree
electener: -3355.55479094 hartree
oneelecener: -5729.18178442 hartree
twoeener: 2373.62699348 hartree
cpcmener: -0.04238753 hartree
kineticenergy: 1523.70887526 hartree
xcener: -113.006074807403 hartree
chargesum: -0.0000000
charge: -0.075396 0.853590 -0.373763 -0.355613 -0.672091 -0.265609 0.127851 -0.268989 -0.302112 0.231042 0.014420 -0.167707 0.037117 -0.242395 -0.013821 -0.174447 -0.228176 -0.247898 -0.273418 0.063944 0.170860 0.088986 0.090193 0.094484 0.095405 0.104397 0.083860 0.132721 0.102293 0.095479 0.185945 0.146847 0.095643 0.101210 0.101048 0.090668 0.088627 0.087089 0.121471 0.134092 0.122154
qa: -0.0754 0.8536 -0.3738 -0.3556 -0.6721 -0.2656 0.1279 -0.2690 -0.3021 0.2310 0.0144 -0.1677 0.0371 -0.2424 -0.0138 -0.1744 -0.2282 -0.2479 -0.2734 0.0639 0.1709 0.0890 0.0902 0.0945 0.0954 0.1044 0.0839 0.1327 0.1023 0.0955 0.1859 0.1468 0.0956 0.1012 0.1010 0.0907 0.0886 0.0871 0.1215 0.1341 0.1222
va: 2.3848 5.5306 2.0679 2.0760 1.9295 3.0623 3.8432 3.9264 3.9121 3.7807 3.6845 3.9784 3.8685 4.0205 3.9347 3.9018 3.8900 3.9615 3.9875 1.0233 1.0172 1.0050 1.0029 1.0097 1.0123 1.0111 1.0041 1.0163 0.9936 0.9945 0.9738 1.0009 1.0076 0.9992 1.0014 1.0070 1.0024 1.0058 0.9948 0.9995 0.9958
dispcorr: -0.019074435 hartree
energy: -1528.864624140768
dipole: 5.36170 -6.44408 -1.08239 -1.22108 1.18561 -0.03547 -13.40022 10.31028 -3.08994
magnitude: 3.27422 au
magnitude: 8.32241 debye
