program: Orca
programVersion: 5.0.2
elementType: S P O O O N C C C C C C C C C C C C C H H H H H H H H H H H H H H H H H H H H H H
charge: 0
multiplicity: 1
keywords: wb97x-d3
keywords: def2-TZVPP
keywords: def2/J RIJCOSX
keywords: DEFGRID2
keywords: scfconv7
keywords: smallprint printgap noloewdin
keywords: NOSOSCF
formula: C13H22NO3PS
InChI: InChI=1/C13H22NO3PS/c1-6-16-18(15,14-10(2)3)17-12-7-8-13(19-5)11(4)9-12/h7-10,14H,6H2,1-5H3
41 atoms
S  -4.75456 0.996224 -0.179746
P  2.015008 -0.221648 0.106195
O  0.827934 -0.871285 -0.807504
O  1.915833 1.31265 -0.315984
O  1.859599 -0.516433 1.552492
N  3.413412 -0.754848 -0.559035
C  3.995164 -2.065557 -0.23914
C  5.480724 -2.02317 -0.554566
C  3.304996 -3.205266 -0.974266
C  -0.473008 -0.440017 -0.637843
C  -2.544912 -0.498957 0.601566
C  -1.226905 -0.913146 0.423335
C  1.881238 2.381664 0.65287
C  -1.006614 0.450715 -1.553286
C  -3.081961 0.420591 -0.310468
C  -2.314566 0.871944 -1.380754
C  -3.32759 -1.030352 1.7619
C  0.464016 2.715592 1.045401
C  -4.603756 2.165514 1.195457
H  3.874903 -2.213508 0.835508
H  3.585975 -0.46113 -1.514929
H  5.648856 -1.848082 -1.619704
H  5.984666 -1.23454 0.003841
H  5.950888 -2.972165 -0.297282
H  3.3628 -3.062098 -2.055228
H  2.253443 -3.28845 -0.698467
H  3.782293 -4.156956 -0.7377
H  -0.795771 -1.629969 1.111242
H  2.481744 2.123378 1.526236
H  2.359578 3.229094 0.164425
H  -0.415095 0.810491 -2.384814
H  -2.741815 1.575897 -2.082722
H  -3.320718 -0.326744 2.596833
H  -4.370242 -1.203967 1.498988
H  -2.901097 -1.964415 2.124338
H  -0.023146 1.881239 1.551438
H  0.474438 3.561768 1.733284
H  -0.135596 2.996586 0.179461
H  -4.325443 1.667405 2.121942
H  -5.581087 2.626425 1.333893
H  -3.880729 2.945664 0.965609
elementType: S P O N C H
totalener: -1528.84146081 hartree
nucrepener: 1841.07915612 hartree
electener: -3369.92061692 hartree
oneelecener: -5758.67107773 hartree
twoeener: 2388.75046081 hartree
cpcmener: -0.03366884 hartree
kineticenergy: 1523.71501517 hartree
xcener: -113.000477775942 hartree
chargesum: 0.0000000
charge: -0.139557 0.909131 -0.379730 -0.381418 -0.672897 -0.279026 0.110268 -0.266569 -0.272325 0.314449 0.028250 -0.209785 0.050513 -0.260982 -0.020980 -0.095970 -0.233753 -0.258695 -0.270033 0.064942 0.158131 0.090451 0.092014 0.088798 0.088488 0.086294 0.092368 0.133165 0.093843 0.105431 0.147025 0.132722 0.109962 0.101126 0.101894 0.083771 0.109061 0.088267 0.118157 0.126354 0.116845
qa: -0.1396 0.9091 -0.3797 -0.3814 -0.6729 -0.2790 0.1103 -0.2666 -0.2723 0.3144 0.0283 -0.2098 0.0505 -0.2610 -0.0210 -0.0960 -0.2338 -0.2587 -0.2700 0.0649 0.1581 0.0905 0.0920 0.0888 0.0885 0.0863 0.0924 0.1332 0.0938 0.1054 0.1470 0.1327 0.1100 0.1011 0.1019 0.0838 0.1091 0.0883 0.1182 0.1264 0.1168
va: 2.2219 5.5065 2.0513 2.0729 1.9096 3.1471 3.8750 3.9209 3.9171 3.6301 3.6713 3.9940 3.8533 4.0483 3.7382 3.9276 3.8717 3.9098 3.9645 1.0225 1.0257 1.0025 1.0111 1.0050 1.0061 1.0162 1.0079 1.0221 1.0049 0.9933 1.0069 1.0144 0.9899 1.0157 1.0057 1.0089 1.0118 1.0036 0.9961 0.9991 1.0001
dispcorr: -0.020439874 hartree
energy: -1528.861900682908
dipole: 8.90991 -7.98508 0.92483 -0.61033 1.51426 0.90393 5.65985 -6.17942 -0.51957
magnitude: 1.39369 au
magnitude: 3.54247 debye
