program: Orca
programVersion: 5.0.2
elementType: S P O O O N C C C C C C C C C C C C C H H H H H H H H H H H H H H H H H H H H H H
charge: 0
multiplicity: 1
keywords: wb97x-d3
keywords: def2-TZVPP
keywords: def2/J RIJCOSX
keywords: DEFGRID2
keywords: scfconv7
keywords: smallprint printgap noloewdin
keywords: NOSOSCF
formula: C13H22NO3PS
InChI: InChI=1/C13H22NO3PS/c1-6-16-18(15,14-10(2)3)17-12-7-8-13(19-5)11(4)9-12/h7-10,14H,6H2,1-5H3
41 atoms
S  -4.778279 0.11274 0.582629
P  2.190269 0.211705 0.074363
O  0.936628 0.062999 -0.948279
O  2.931325 1.562677 -0.341623
O  1.75008 0.171195 1.494232
N  3.216047 -0.907311 -0.55767
C  2.855742 -2.331797 -0.603535
C  3.091254 -3.031532 0.726894
C  3.628108 -2.998566 -1.729148
C  -0.383689 0.106142 -0.550669
C  -2.261201 -0.883341 0.597872
C  -0.917001 -0.891721 0.251522
C  2.77095 2.781776 0.412189
C  -1.183638 1.130529 -1.01825
C  -3.079096 0.153994 0.117961
C  -2.53096 1.147718 -0.685956
C  -2.81752 -1.969734 1.465971
C  1.412278 3.409527 0.221371
C  -5.473151 1.551191 -0.245655
H  1.791843 -2.389781 -0.843398
H  4.192598 -0.753674 -0.327991
H  2.798743 -4.080451 0.665871
H  4.146559 -2.994658 1.004782
H  2.513364 -2.572765 1.529327
H  3.42174 -2.523677 -2.688316
H  3.353112 -4.050501 -1.807897
H  4.704487 -2.949387 -1.549274
H  -0.288698 -1.701877 0.602895
H  2.971711 2.592994 1.46785
H  3.553752 3.440721 0.040129
H  -0.769844 1.908839 -1.646181
H  -3.139602 1.955857 -1.066454
H  -3.608033 -2.526868 0.958172
H  -2.041476 -2.678868 1.748403
H  -3.249767 -1.569186 2.385551
H  1.399386 4.380801 0.717178
H  1.190175 3.570886 -0.833523
H  0.615598 2.807548 0.659896
H  -5.036692 2.481973 0.112698
H  -6.533986 1.554837 -0.000447
H  -5.373401 1.487344 -1.328029
elementType: S P O N C H
totalener: -1528.84317689 hartree
nucrepener: 1831.68284390 hartree
electener: -3360.52602079 hartree
oneelecener: -5740.14418524 hartree
twoeener: 2379.61816445 hartree
cpcmener: -0.03794029 hartree
kineticenergy: 1523.70432408 hartree
xcener: -113.005034758875 hartree
chargesum: -0.0000000
charge: -0.074940 0.868437 -0.377191 -0.383721 -0.665340 -0.252461 0.100684 -0.278268 -0.264937 0.272667 -0.001228 -0.139142 0.045801 -0.268568 -0.029469 -0.147348 -0.236129 -0.265648 -0.274278 0.072875 0.152883 0.093338 0.093747 0.083848 0.091509 0.088577 0.091426 0.137373 0.094140 0.107301 0.157890 0.147667 0.101818 0.095009 0.101258 0.105233 0.091908 0.086122 0.121761 0.133799 0.121601
qa: -0.0749 0.8684 -0.3772 -0.3837 -0.6653 -0.2525 0.1007 -0.2783 -0.2649 0.2727 -0.0012 -0.1391 0.0458 -0.2686 -0.0295 -0.1473 -0.2361 -0.2656 -0.2743 0.0729 0.1529 0.0933 0.0937 0.0838 0.0915 0.0886 0.0914 0.1374 0.0941 0.1073 0.1579 0.1477 0.1018 0.0950 0.1013 0.1052 0.0919 0.0861 0.1218 0.1338 0.1216
va: 2.3857 5.5372 2.0645 2.0864 1.8734 3.1145 3.8715 3.9233 3.9214 3.6941 3.7217 3.9067 3.8530 4.0423 3.9373 3.8618 3.8939 3.9017 3.9881 1.0141 1.0275 1.0065 1.0053 1.0198 1.0111 1.0048 1.0038 0.9978 1.0055 0.9930 0.9944 0.9970 1.0000 1.0086 0.9997 1.0095 1.0044 1.0106 0.9949 0.9993 0.9953
dispcorr: -0.019411914 hartree
energy: -1528.862588808762
dipole: 4.64554 -4.31254 0.33300 -4.47193 4.93128 0.45935 -0.51453 -0.45136 -0.96589
magnitude: 1.12020 au
magnitude: 2.84731 debye
