program: Orca
programVersion: 5.0.2
elementType: S P O O O N C C C C C C C C C C C C C H H H H H H H H H H H H H H H H H H H H H H
charge: 0
multiplicity: 1
keywords: wb97x-d3
keywords: def2-TZVPP
keywords: def2/J RIJCOSX
keywords: DEFGRID2
keywords: scfconv7
keywords: smallprint printgap noloewdin
keywords: NOSOSCF
formula: C13H22NO3PS
InChI: InChI=1/C13H22NO3PS/c1-6-16-18(15,14-10(2)3)17-12-7-8-13(19-5)11(4)9-12/h7-10,14H,6H2,1-5H3
41 atoms
S  -4.47552 -1.08684 -0.202403
P  2.048928 0.774795 0.730342
O  0.818233 1.553956 -0.003288
O  3.224611 1.811377 0.455979
O  1.855197 0.574104 2.185515
N  2.301136 -0.608619 -0.111155
C  2.255599 -1.947319 0.488851
C  3.240206 -2.852226 -0.232623
C  0.847001 -2.521596 0.472031
C  -0.423424 0.941899 -0.012239
C  -2.089686 -0.315116 -1.223335
C  -0.846728 0.301065 -1.165922
C  3.93736 1.950111 -0.78611
C  -1.229739 0.97807 1.109796
C  -2.910479 -0.28489 -0.082795
C  -2.47337 0.364143 1.067842
C  -2.532412 -1.003675 -2.477451
C  3.236298 2.865157 -1.760665
C  -5.220104 -0.790487 1.409818
H  2.581832 -1.847273 1.52468
H  2.13572 -0.5901 -1.110866
H  4.253927 -2.454538 -0.182213
H  3.245259 -3.844295 0.219149
H  2.970717 -2.967606 -1.28474
H  0.152948 -1.886293 1.024753
H  0.829756 -3.511457 0.930231
H  0.477917 -2.619987 -0.551006
H  -0.199985 0.281129 -2.035318
H  4.907483 2.360834 -0.51012
H  4.111921 0.966321 -1.22663
H  -0.908316 1.488156 2.008122
H  -3.09118 0.401729 1.953843
H  -1.768918 -0.937065 -3.250607
H  -2.73685 -2.062872 -2.305225
H  -3.448661 -0.562983 -2.876818
H  3.885783 3.019881 -2.622608
H  2.300538 2.444906 -2.12687
H  3.033561 3.84022 -1.317622
H  -5.349952 0.271956 1.608987
H  -4.651665 -1.25262 2.215102
H  -6.204453 -1.254484 1.375545
elementType: S P O N C H
totalener: -1528.84356405 hartree
nucrepener: 1854.98713224 hartree
electener: -3383.83069629 hartree
oneelecener: -5785.97508506 hartree
twoeener: 2402.14438876 hartree
cpcmener: -0.04425361 hartree
kineticenergy: 1523.70623291 hartree
xcener: -113.008430582167 hartree
chargesum: -0.0000000
charge: -0.075216 0.874131 -0.374758 -0.373311 -0.673274 -0.274711 0.133096 -0.268656 -0.289230 0.262055 0.029141 -0.204707 0.050788 -0.225591 -0.025801 -0.163223 -0.229657 -0.248130 -0.274417 0.058150 0.170102 0.090705 0.089428 0.090174 0.085298 0.104120 0.089137 0.138361 0.106241 0.086448 0.146246 0.148922 0.096358 0.100936 0.104750 0.098308 0.079541 0.089511 0.121974 0.122568 0.134197
qa: -0.0752 0.8741 -0.3748 -0.3733 -0.6733 -0.2747 0.1331 -0.2687 -0.2892 0.2621 0.0291 -0.2047 0.0508 -0.2256 -0.0258 -0.1632 -0.2297 -0.2481 -0.2744 0.0582 0.1701 0.0907 0.0894 0.0902 0.0853 0.1041 0.0891 0.1384 0.1062 0.0864 0.1462 0.1489 0.0964 0.1009 0.1047 0.0983 0.0795 0.0895 0.1220 0.1226 0.1342
va: 2.3845 5.5265 2.0469 2.0967 1.9272 3.0589 3.8465 3.9251 3.9232 3.6930 3.6331 3.9406 3.8664 4.0769 3.9283 3.8850 3.8897 3.9297 3.9873 1.0260 1.0135 1.0108 1.0054 1.0027 1.0095 1.0119 1.0023 1.0047 0.9887 1.0082 1.0143 0.9965 1.0074 1.0001 1.0008 1.0089 1.0094 1.0056 0.9953 0.9949 0.9992
dispcorr: -0.020748988 hartree
energy: -1528.864313038582
dipole: 4.35365 -4.42605 -0.07240 -10.98891 9.96171 -1.02720 -9.26088 6.84673 -2.41416
magnitude: 2.62460 au
magnitude: 6.67121 debye
