program: Orca
programVersion: 5.0.2
elementType: S P O O O N C C C C C C C C C C C C C H H H H H H H H H H H H H H H H H H H H H H
charge: 0
multiplicity: 1
keywords: wb97x-d3
keywords: def2-TZVPP
keywords: def2/J RIJCOSX
keywords: DEFGRID2
keywords: scfconv7
keywords: smallprint printgap noloewdin
keywords: NOSOSCF
formula: C13H22NO3PS
InChI: InChI=1/C13H22NO3PS/c1-6-16-18(15,14-10(2)3)17-12-7-8-13(19-5)11(4)9-12/h7-10,14H,6H2,1-5H3
41 atoms
S  -4.648188 1.437474 0.118826
P  2.074384 -0.234146 0.082854
O  0.786293 -0.72952 -0.786754
O  2.074269 1.323645 -0.256417
O  1.989981 -0.590088 1.521531
N  3.376695 -0.850293 -0.69707
C  3.85451 -2.222281 -0.472089
C  5.304654 -2.305721 -0.916943
C  2.998847 -3.263188 -1.17975
C  -0.472587 -0.222571 -0.536664
C  -2.433423 -0.07003 0.865453
C  -1.152101 -0.559597 0.622558
C  2.237594 2.332154 0.763783
C  -1.047359 0.607036 -1.484641
C  -3.0299 0.747474 -0.104513
C  -2.332104 1.074503 -1.264866
C  -3.124372 -0.445104 2.139483
C  0.902407 2.759324 1.318684
C  -5.695606 -0.022553 -0.110685
H  3.812642 -2.401899 0.603577
H  3.507581 -0.53264 -1.651992
H  5.9285 -1.589699 -0.382274
H  5.7010 -3.303773 -0.730788
H  5.397161 -2.106689 -1.98717
H  1.971951 -3.262113 -0.81369
H  3.403023 -4.263253 -1.018169
H  2.976483 -3.081441 -2.256212
H  -0.68996 -1.214563 1.350309
H  2.896943 1.972292 1.55496
H  2.739536 3.163162 0.271035
H  -0.510387 0.868606 -2.386925
H  -2.799449 1.70797 -2.00719
H  -2.400988 -0.69106 2.915479
H  -3.760395 0.360753 2.50327
H  -3.760366 -1.321814 2.001566
H  1.053273 3.5669 2.035643
H  0.243819 3.12856 0.532189
H  0.400446 1.942157 1.837637
H  -5.536946 -0.466683 -1.091155
H  -6.729578 0.314042 -0.044936
H  -5.529847 -0.77012 0.662325
elementType: S P O N C H
totalener: -1528.84136724 hartree
nucrepener: 1831.57740146 hartree
electener: -3360.41876870 hartree
oneelecener: -5739.81408351 hartree
twoeener: 2379.39531480 hartree
cpcmener: -0.03292941 hartree
kineticenergy: 1523.71175901 hartree
xcener: -112.999992364389 hartree
chargesum: -0.0000000
charge: -0.136598 0.906817 -0.376529 -0.379265 -0.671025 -0.279218 0.109448 -0.267962 -0.271976 0.297108 0.046703 -0.212528 0.049561 -0.259832 -0.029551 -0.088190 -0.243002 -0.253903 -0.270852 0.065934 0.157657 0.092564 0.088989 0.090473 0.086011 0.092483 0.088401 0.130737 0.093514 0.105825 0.148111 0.132377 0.104841 0.102086 0.111585 0.107053 0.086644 0.083103 0.118522 0.125476 0.118411
qa: -0.1366 0.9068 -0.3765 -0.3793 -0.6710 -0.2792 0.1094 -0.2680 -0.2720 0.2971 0.0467 -0.2125 0.0496 -0.2598 -0.0296 -0.0882 -0.2430 -0.2539 -0.2709 0.0659 0.1577 0.0926 0.0890 0.0905 0.0860 0.0925 0.0884 0.1307 0.0935 0.1058 0.1481 0.1324 0.1048 0.1021 0.1116 0.1071 0.0866 0.0831 0.1185 0.1255 0.1184
va: 2.2299 5.5051 2.0541 2.0728 1.9066 3.1483 3.8762 3.9215 3.9149 3.6504 3.6358 3.9587 3.8517 4.0688 3.7528 3.9333 3.8720 3.9104 3.9652 1.0223 1.0259 1.0110 1.0047 1.0024 1.0165 1.0080 1.0063 1.0291 1.0048 0.9935 1.0047 1.0148 1.0035 1.0173 0.9889 1.0119 1.0044 1.0103 0.9997 0.9990 0.9958
dispcorr: -0.019955514 hartree
energy: -1528.861322753923
dipole: 6.13302 -5.74247 0.39055 -7.31436 7.05943 -0.25493 1.58528 -2.80039 -1.21511
magnitude: 1.30154 au
magnitude: 3.30826 debye
